program: Gaussian 09
title: 000180829
version: EM64L-G09RevD.01
frameworkgroup: C1[X(C17H12F6N2O3S)]
method: RPBEPBE
basis: SDD
operation: Freq
keyword: #p
keyword: freq=noraman
keyword: PBEPBE/SDD
title: #p freq=noraman PBEPBE/SDD
converged: YES YES NO NO
title: Mulliken charges:
elementType: S F F F F F F O O O N N C C C C C C C C C C C C C C C C C H H H H H H H H H H H H
charge: 0.642244 -0.136396 -0.147260 -0.171792 -0.176788 -0.197698 -0.158347 -0.598440 -0.258297 -0.264077 -0.486964 -0.452787 0.294313 -0.245713 0.327092 -0.349128 -0.208015 -0.312819 0.121830 -0.821567 0.128606 0.237710 -0.076430 0.209254 0.280118 0.266020 -0.370433 -0.376529 -0.141556 0.254952 0.291947 0.310675 0.238441 0.247666 0.243413 0.408005 0.276148 0.375767 0.272572 0.271883 0.252379
chargesum: 0.00000
title: Mulliken charges with hydrogens summed into heavy atoms:
elementType: S F F F F F F O O O N N C C C C C C C C C C C C C C C C C
charge: 0.642244 -0.136396 -0.147260 -0.171792 -0.176788 -0.197698 -0.158347 -0.598440 -0.258297 -0.264077 -0.078959 -0.077020 0.294313 -0.245713 0.327092 -0.094176 0.083932 -0.002143 0.121830 -0.092046 0.404754 0.237710 -0.076430 0.209254 0.280118 0.266020 -0.097861 -0.104646 0.110823
polarizability: 4.25667682e+02 6.65955768e+00 2.26555512e+02 1.39108320e+01 -1.22518827e+01 1.31792155e+02
1716.lowfreq: -4.9157 -0.0009 -0.0001 0.0007 0.8457 2.3108 12.9453 14.0275 22.3915
frequency: 12.7750 13.9542 22.1627 30.4739 33.0425 41.3662 50.6669 58.0845 78.9598 98.5017 117.1471 129.7912 130.6110 148.1039 171.5638 181.1665 190.5923 197.2108 202.7386 216.5289 228.5963 234.2703 247.1670 252.8394 272.5984 286.4832 292.0531 327.1732 338.2997 377.8028 383.1652 396.1503 411.4203 433.1434 446.6105 463.0978 477.2325 484.9394 496.5675 520.4712 522.0968 526.2462 565.1135 572.6393 576.8021 599.4723 660.1845 669.5879 677.8251 728.7232 739.7303 747.3431 758.1449 760.8578 802.3161 804.7612 806.5275 813.8406 838.4644 875.9972 878.3896 885.1139 886.4859 892.6714 941.2308 967.7310 971.9095 980.3196 996.3222 1002.3731 1004.3889 1041.8712 1044.6469 1053.3129 1078.2810 1103.3594 1129.0805 1168.1441 1171.0236 1187.5497 1191.9017 1210.7584 1234.1265 1258.0174 1278.7226 1286.2362 1289.6809 1330.2923 1375.9715 1382.9934 1402.6011 1406.1892 1437.7472 1438.5889 1458.1461 1467.6350 1478.2989 1485.0940 1540.7986 1569.8899 1582.8764 1598.5616 1620.9417 1626.0695 1675.7917 2973.1384 3046.1052 3069.6372 3096.0878 3137.3343 3144.0366 3165.0058 3185.1805 3193.0997 3195.1482 3228.2225 3520.0920
redmass: 9.1524 11.1296 10.7109 7.0894 10.6711 8.6637 9.0369 6.4786 6.9629 9.1611 10.4988 9.9739 13.3013 5.3273 3.7515 4.4424 5.1000 3.1868 2.2518 7.1144 4.8266 9.9325 9.7548 12.8946 5.0727 10.5302 9.0649 12.0434 10.6363 8.9858 12.0312 11.5925 10.2650 7.0586 3.0384 5.8630 5.1624 9.8574 5.9823 7.0410 6.0108 14.1905 6.6928 3.8287 5.3878 5.9685 2.0985 4.0406 5.1357 6.8774 3.3297 2.5875 7.6126 2.2285 10.3434 3.7154 3.9628 5.9417 6.4099 1.3420 1.3613 1.3983 5.2862 1.2288 7.0460 6.3944 1.3510 7.9342 1.5933 1.3870 5.3367 1.7460 5.9009 2.4151 2.0669 2.5872 1.7700 1.1358 5.9657 3.8367 2.0901 2.1369 4.1665 2.6996 1.4525 1.2443 2.0892 1.3579 10.8209 5.5358 3.4844 1.3358 2.6736 2.6079 2.5280 1.8750 1.0525 1.5602 3.0754 5.2137 6.4531 5.2120 5.6552 3.6393 4.0786 1.0394 1.0975 1.0873 1.0971 1.0920 1.0908 1.0885 1.0932 1.0945 1.0998 1.0821 1.0779
irintensity: 0.2491 0.3714 0.4091 0.4167 1.3288 2.9021 1.4347 0.4535 1.2076 1.9888 0.6833 2.9654 5.4218 5.3423 7.8001 6.3838 2.4889 4.1019 0.5491 7.4465 0.0808 2.8630 9.5736 8.6172 1.0238 12.2574 8.5005 2.1923 10.2267 8.2843 3.3397 8.8154 4.8554 1.6946 4.6442 18.7812 0.1865 10.0804 4.1590 26.6525 2.8506 5.2228 2.8857 15.2290 4.7631 44.4065 36.8728 1.2495 2.2679 6.7069 13.9400 67.8453 71.4746 4.7318 27.7121 60.5644 73.7822 25.8777 14.5437 45.4984 3.4845 0.2690 16.6711 95.8578 47.5530 65.3101 3.2629 90.1160 1.2439 7.2876 47.4027 36.6205 212.6897 9.8309 56.6791 2.2713 11.9874 6.1020 173.0103 240.9917 3.6183 35.5056 7.6067 330.9475 24.9503 9.9809 32.7516 7.5827 1.4364 66.4326 35.1147 6.4467 97.3092 69.1133 378.8954 86.2125 14.6881 96.5699 803.5560 10.4641 215.2230 36.0028 177.4515 3.1622 308.0835 13.8216 11.7053 1.9543 17.7672 3.2286 6.4664 4.1146 0.2030 4.9138 1.3903 382.2599 68.6181
temp: 298.150 k
press: 1.00000 atm
elementType: 16 9 9 9 9 9 9 8 8 8 7 7 6 6 6 6 6 6 6 6 6 6 6 6 6 6 6 6 6 1 1 1 1 1 1 1 1 1 1 1 1
symmnumber: 1
zpe: 702850.5 jmol-1
zpe.correction: 0.267702 hartree
zpe.thermalcorrener: 0.295535 hartree
zpe.thermalcorrenthalpy: 0.296479 hartree
zpe.thermalcorrgfe: 0.204747 hartree
zpe.sumelectzpe: -1985.146416 hartree
zpe.sumelectthermal: -1985.118583 hartree
zpe.sumelectthermalent: -1985.117639 hartree
zpe.sumelectthermalfe: -1985.209371 hartree
dipole: 10.6163 2.0356 -1.2934
dipole: 10.8868
quadrupole: -131.3844 -182.7445 -175.1460
quadrupole: -3.3020 11.6201 -5.2804
quadrupole: 31.7072 -19.6529 -12.0543 -3.3020 11.6201 -5.2804
hfenergy: -1985.4141177 hartree
pointgroup: C01 [X(C17H12F6N2O3S1)]
dipole: -4.1516801 -0.7852172 0.7020564 debye
polarizability: 426.0138548|-4.251616|140.5922147|-9.8946652|-30.925356|217.4092793 unknown
InChI: InChI=1S/C17H12F6N2O3S/c1-8-7-9(29(28)17(22,23)15(20)21)5-6-12(8)24-16(27)25-14(26)13-10(18)3-2-4-11(13)19/h2-7,15,24-25H,1H3
charge 0 multiplicity 1
41 atoms
S  5.445804 -1.320488 -0.88134
F  5.298845 -0.285069 1.789871
F  7.400503 -0.548215 0.941634
F  4.819756 1.89021 0.203706
F  6.96961 2.149829 0.981195
F  -5.239797 -0.133874 -2.251661
F  -4.755586 -0.467012 2.571577
O  5.91149 -0.43918 -2.220136
O  -1.066919 0.929114 -2.384346
O  -2.745874 -1.209321 0.841448
N  -0.576292 -0.491204 -0.544977
N  -2.796453 0.207399 -1.013691
C  1.454827 -1.472842 0.348303
C  3.593597 -1.005845 -0.726445
C  0.830318 -0.640592 -0.640328
C  2.853181 -1.652206 0.280898
C  2.993082 -0.196268 -1.701531
C  1.598702 -0.010824 -1.657254
C  6.096255 -0.096692 0.64921
C  0.643362 -2.145803 1.440255
C  6.136076 1.353345 0.143477
C  -1.396765 0.245331 -1.377362
C  -4.900132 -0.343281 0.147605
C  -3.408181 -0.490703 0.024107
C  -5.787638 -0.210794 -0.951204
C  -5.536582 -0.393117 1.418735
C  -7.182965 -0.157592 -0.842182
C  -6.929702 -0.337266 1.58876
C  -7.75313 -0.225511 0.448132
H  3.346215 -2.28552 1.026781
H  3.61223 0.269455 -2.476593
H  1.095758 0.612441 -2.398454
H  1.294719 -2.738256 2.102603
H  0.111363 -1.410038 2.073878
H  -0.122749 -2.831072 1.028569
H  -1.079757 -0.980316 0.221279
H  6.50031 1.401208 -0.898474
H  -3.376181 0.72855 -1.678754
H  -7.793391 -0.067171 -1.743891
H  -7.345082 -0.376165 2.598797
H  -8.839929 -0.185944 0.563809
