program: Gaussian 09
title: 000180906
version: EM64L-G09RevD.01
frameworkgroup: C1[X(C20H22N2O2)]
method: RPBEPBE
basis: SDD
operation: Freq
keyword: #p
keyword: freq=noraman
keyword: PBEPBE/SDD
title: #p freq=noraman PBEPBE/SDD
converged: YES YES NO NO
title: Mulliken charges:
elementType: O O N N C C C C C C C C C C C C C C C C C C C C H H H H H H H H H H H H H H H H H H H H H H
charge: -0.199286 -0.307175 -0.433794 -0.155236 0.138767 0.475917 -0.702556 -0.789186 -0.602105 0.226643 0.173388 0.106113 0.050485 -0.365442 -0.417217 0.350126 -0.566829 0.485171 -0.525384 -0.276013 -0.244273 -0.239695 -0.783241 -0.821604 0.395773 0.207570 0.269773 0.218373 0.236787 0.224061 0.226986 0.265992 0.269622 0.290701 0.241736 0.257415 0.240974 0.224538 0.220482 0.225394 0.244740 0.223091 0.243836 0.227819 0.233750 0.233012
chargesum: 0.00000
title: Mulliken charges with hydrogens summed into heavy atoms:
elementType: O O N N C C C C C C C C C C C C C C C C C C C C
charge: -0.199286 -0.307175 -0.038021 -0.155236 0.138767 0.475917 -0.006840 -0.101352 -0.066491 0.226643 0.173388 0.106113 0.050485 -0.074741 -0.175481 0.350126 -0.309413 0.485171 -0.284410 -0.051475 -0.023790 -0.014301 -0.071574 -0.127023
polarizability: 2.90343328e+02 -7.20335573e+00 2.40388445e+02 -2.20366241e+00 -7.16704491e+00 1.75611036e+02
1716.lowfreq: -10.4676 -4.6492 -2.3625 -0.0007 -0.0005 0.0001 6.0874 16.4998 33.4098
frequency: -5.1238 16.2688 33.3967 53.8994 63.9543 74.9218 80.1007 102.9588 112.9024 124.8472 143.0226 151.3878 191.9953 209.2049 216.5902 228.7138 244.7807 280.8919 291.8068 299.8597 315.6425 320.4745 330.6472 355.5189 358.8348 399.9581 405.6511 447.2024 456.3980 498.8199 502.0454 525.9117 534.2032 568.9120 572.5815 586.4657 616.5361 618.4047 639.6829 658.8763 708.1998 717.5044 727.6304 755.9939 772.7515 786.3439 790.6606 839.8884 858.8249 870.1084 881.3271 903.4516 906.0040 932.0307 935.4733 937.7419 939.4645 962.7982 973.7234 982.5499 989.7582 1002.7815 1007.2135 1013.1910 1025.0091 1028.8491 1046.5831 1052.6932 1082.8627 1105.9354 1125.2656 1172.4383 1176.0836 1184.5530 1190.7595 1199.9813 1203.1595 1208.2407 1247.8480 1262.3914 1288.5714 1291.0422 1327.6577 1364.8721 1375.2793 1379.4470 1392.8140 1397.2723 1400.7493 1402.7117 1409.4640 1423.6067 1433.6540 1454.9633 1457.8286 1462.3188 1470.7393 1473.9816 1475.4377 1481.1823 1485.5792 1486.2756 1494.6386 1502.3380 1562.6042 1588.7434 1612.0812 1614.7619 1618.8841 1622.1031 2978.6441 2985.4226 2985.7130 2991.5990 2992.2889 3042.7997 3056.8387 3063.7460 3079.8102 3082.3960 3087.7830 3097.6621 3098.6921 3119.1525 3121.9343 3128.1638 3130.4506 3144.6827 3146.5798 3152.8902 3163.2599 3281.2598
redmass: 4.7451 4.3227 4.2157 4.7237 4.4609 1.0533 1.0313 5.7554 2.9887 4.8311 3.8233 3.5836 3.1728 2.9704 1.9804 1.5541 2.6473 4.2544 3.1880 3.4726 1.9220 2.9057 2.0151 3.4468 4.5197 3.3479 2.8609 5.7403 4.3592 4.2089 3.8345 3.7188 3.4111 3.6875 4.0828 3.4954 5.3698 5.4862 4.9436 5.7406 1.6957 5.0593 4.5185 4.4687 1.9414 6.5525 1.1247 4.6510 1.2475 1.3983 4.5669 1.3559 2.7374 1.6570 2.6870 1.4950 2.6633 3.5206 2.4273 1.4434 4.1933 1.3913 1.8940 1.5100 1.5861 2.4863 1.5053 1.5623 1.7026 2.0181 2.8361 1.0898 3.0385 2.7311 2.4416 1.9955 1.1607 1.1209 3.1072 1.3703 3.8046 3.0751 1.3654 3.3009 3.4972 1.4376 2.7186 1.2049 1.2828 1.5408 3.0744 1.3870 2.1899 1.0889 2.2136 1.0440 1.0462 1.0613 1.2828 1.0619 2.0178 1.4207 1.0660 2.9087 1.8834 5.4948 5.8315 3.9012 7.2115 5.4500 1.0375 1.0371 1.0362 1.0624 1.0378 1.0954 1.0977 1.0974 1.0993 1.0998 1.0987 1.0997 1.0998 1.0845 1.0912 1.0947 1.0920 1.0931 1.0930 1.0955 1.1001 1.0829
irintensity: 0.1099 0.5718 0.0439 3.1340 2.9629 0.2662 0.5075 3.8344 13.6180 0.4298 0.2021 0.1185 3.4187 1.0913 0.5624 0.1930 7.9862 0.8303 4.3053 1.0437 2.2020 1.1338 1.4410 1.4293 0.2135 1.3132 0.3988 0.4699 12.1498 0.5086 3.8272 5.6883 7.8192 8.1797 14.6809 5.9830 0.4283 0.4425 9.2914 1.1653 67.1008 19.7756 21.7855 3.0684 33.3042 7.7376 61.9948 18.9911 1.4063 29.3869 4.6020 0.1896 2.3444 3.2318 4.9096 1.0439 5.1565 5.8247 2.2357 0.4641 0.0799 3.2735 3.6794 2.2802 4.3560 15.9755 0.3048 18.5348 8.9577 6.8059 14.0234 0.0787 42.3189 0.7112 13.4860 6.1446 10.1265 1.9556 48.0489 4.9554 122.2134 10.9257 2.8999 33.7201 10.2022 23.8910 0.6435 35.3773 17.8605 17.6736 1.5972 24.8196 15.1522 7.3764 47.6384 15.5377 12.6082 2.7243 4.5301 4.1280 30.7557 5.2315 25.3814 22.5843 311.9440 9.6836 7.7115 207.4002 7.0069 41.7319 35.7152 19.8496 15.2291 2.7229 32.5095 1.7281 17.8228 12.8777 23.5902 35.2552 15.0298 20.2150 52.1670 0.1639 17.0104 13.8727 8.5583 8.8588 4.9558 35.0879 29.6269 459.1809
temp: 298.150 k
press: 1.00000 atm
elementType: 8 8 7 7 6 6 6 6 6 6 6 6 6 6 6 6 6 6 6 6 6 6 6 6 1 1 1 1 1 1 1 1 1 1 1 1 1 1 1 1 1 1 1 1 1 1
symmnumber: 1
zpe: 979895.3 jmol-1
zpe.correction: 0.373222 hartree
zpe.thermalcorrener: 0.395385 hartree
zpe.thermalcorrenthalpy: 0.396330 hartree
zpe.thermalcorrgfe: 0.321246 hartree
zpe.sumelectzpe: -1033.539069 hartree
zpe.sumelectthermal: -1033.516906 hartree
zpe.sumelectthermalent: -1033.515962 hartree
zpe.sumelectthermalfe: -1033.591046 hartree
dipole: 5.2472 1.3905 0.5107
dipole: 5.4523
quadrupole: -118.7598 -140.9849 -139.6215
quadrupole: -9.9085 2.1653 -2.8340
quadrupole: 14.3623 -7.8628 -6.4995 -9.9085 2.1653 -2.8340
hfenergy: -1033.9122916 hartree
pointgroup: C01 [X(C20H22N2O2)]
dipole: -2.1301237 0.2151581 -0.1332229 debye
polarizability: 281.2539401|4.1227562|175.1920493|20.4406383|-3.6894096|249.8968194 unknown
InChI: InChI=1S/C20H22N2O2/c1-13-10-14(2)19-16(11-13)17(22-24-19)12-18(23)21-20(3,4)15-8-6-5-7-9-15/h5-11,21H,12H2,1-4H3
charge 0 multiplicity 1
46 atoms
O  -2.317248 -0.157809 1.214625
O  2.671452 -0.618823 -1.64241
N  1.754948 -0.78718 0.521818
N  -0.947916 -0.413061 0.732298
C  2.981502 -1.024693 1.362157
C  3.738663 0.312668 1.593625
C  3.918568 -2.067895 0.69266
C  2.442299 -1.634697 2.680802
C  0.274398 -0.42517 -1.455278
C  1.684774 -0.614715 -0.836016
C  -0.956647 -0.237894 -0.603511
C  -2.280705 0.12685 -1.077399
C  -3.089573 0.163922 0.082174
C  4.353183 0.97342 0.49321
C  3.8508 0.906113 2.876698
C  -4.465614 0.481923 0.079754
C  -2.845419 0.421189 -2.344442
C  -4.21644 0.74412 -2.405578
C  -4.992163 0.767812 -1.198973
C  5.051764 2.185492 0.676078
C  4.553193 2.120235 3.061181
C  5.158137 2.766611 1.961641
C  -5.287457 0.51002 1.349301
C  -4.888018 1.06605 -3.72957
H  0.862622 -0.702295 1.041111
H  3.37614 -3.018215 0.536494
H  4.285245 -1.719013 -0.283116
H  4.780708 -2.256978 1.356726
H  1.922282 -2.583168 2.460101
H  1.726665 -0.96253 3.189344
H  3.271399 -1.851758 3.375217
H  0.367731 0.440329 -2.137936
H  0.118819 -1.300417 -2.117542
H  4.264972 0.540994 -0.508982
H  3.393135 0.42968 3.749086
H  -2.236871 0.398636 -3.254505
H  -6.057103 1.023772 -1.271518
H  5.514369 2.676843 -0.187699
H  4.626315 2.557153 4.063986
H  5.703742 3.70669 2.102536
H  -4.883908 1.245484 2.069493
H  -6.336789 0.773366 1.137086
H  -5.27148 -0.472215 1.856564
H  -4.167581 1.045319 -4.564646
H  -5.690198 0.339947 -3.960176
H  -5.3530 2.069391 -3.711462
