program: Gaussian 09
title: 000180790
version: EM64L-G09RevD.01
frameworkgroup: C1[X(C14H12ClN3O2)]
method: RPBEPBE
basis: SDD
operation: Freq
keyword: #p
keyword: freq=noraman
keyword: PBEPBE/SDD
title: #p freq=noraman PBEPBE/SDD
converged: NO YES NO NO
title: Mulliken charges:
elementType: Cl O O N N N C C C C C C C C C C C C C C H H H H H H H H H H H H
charge: -0.038549 -0.258475 -0.279973 -0.472019 -0.401046 -0.501878 0.507257 0.314425 -0.357586 -0.455611 0.264326 -0.354298 -0.351601 0.137351 -0.339611 -0.329663 0.130522 -0.219903 -0.209656 -0.098725 0.311344 0.223595 0.313594 0.224015 0.276081 0.223295 0.281097 0.260969 0.263173 0.327076 0.306988 0.303485
chargesum: 0.00000
title: Mulliken charges with hydrogens summed into heavy atoms:
elementType: Cl O O N N N C C C C C C C C C C C C C C
charge: -0.038549 -0.258475 -0.279973 -0.158425 -0.073970 0.108595 0.507257 0.314425 -0.046242 -0.232016 0.264326 -0.130283 -0.075520 0.137351 -0.116316 -0.048566 0.130522 0.041066 0.053517 -0.098725
polarizability: 3.88571586e+02 5.37391743e-01 1.76671984e+02 -4.32778085e+00 -1.09313517e+00 8.07031103e+01
1716.lowfreq: -7.4937 -3.3329 0.0009 0.0011 0.0018 3.4285 19.6596 29.4677 42.4338
frequency: 19.6580 29.4524 42.4296 51.3011 67.1713 89.6999 109.0504 120.1172 136.3958 172.6124 197.2298 202.8630 264.5182 275.2863 304.3093 314.2804 340.2906 369.2447 406.8136 409.1812 418.1671 461.9989 473.0551 514.2178 525.1486 551.1667 621.4157 627.1765 635.2960 650.8019 677.3876 690.9813 712.7503 741.5709 762.9137 786.0218 813.1848 826.4215 843.5769 851.0099 860.6011 863.3818 871.8398 950.4934 979.8260 984.3339 989.8927 998.4512 1005.2825 1056.4418 1073.1676 1086.7882 1113.9580 1125.4506 1185.3351 1188.4787 1203.8595 1245.0879 1262.0613 1283.8290 1289.0673 1296.8367 1312.6996 1365.6486 1368.4384 1395.6464 1415.6906 1442.9884 1471.0380 1495.8775 1509.7395 1568.1922 1577.0122 1596.7710 1600.9997 1609.9031 1623.0635 1681.1652 3113.6847 3126.0415 3131.2390 3158.1423 3163.9761 3172.5390 3177.4445 3198.6317 3385.2620 3498.8619 3531.0834 3565.8683
redmass: 7.7707 4.6061 8.0436 4.5333 6.2608 8.2830 5.8055 3.7953 1.3568 6.3704 4.0529 7.1952 6.5504 6.2880 6.9257 5.5418 5.3400 7.7549 2.8851 2.9300 5.6620 5.7238 3.9889 4.2856 3.0702 1.2475 6.0834 5.3672 4.8444 1.4774 4.2721 3.7493 6.9015 3.5209 4.0736 1.6875 2.8884 1.8074 1.3064 1.5914 3.9507 2.3004 4.7610 1.3769 1.3614 1.3810 1.3526 4.1181 3.1557 3.8656 3.4479 2.6393 1.3829 1.3720 1.3698 1.1381 2.2459 3.3117 1.9675 1.8374 1.3633 1.2806 1.4678 4.5632 5.2964 4.1256 4.1939 1.7356 2.2766 2.3038 2.9653 8.1822 5.0823 6.1807 8.3190 4.5530 6.5738 1.0611 1.0901 1.0896 1.0907 1.0889 1.0945 1.0952 1.0975 1.0945 1.0428 1.0983 1.0759 1.0791
irintensity: 0.0863 0.7622 1.0366 4.3183 1.0797 5.3268 3.7239 4.1901 21.9526 1.4030 1.8964 5.1223 11.5680 9.4812 2.8850 12.5220 6.0993 22.1092 0.3152 0.4523 2.9442 3.7092 21.2181 16.0922 11.7612 192.0327 4.1954 1.6693 2.9789 28.0838 29.3019 7.6768 6.7829 23.2193 13.6947 134.5078 41.9327 11.9957 8.1883 37.9838 19.2821 52.6668 51.6805 0.9162 1.1786 4.8065 4.8680 56.3713 3.5059 14.3682 43.4236 47.4188 19.4990 24.6808 27.6236 21.4898 3.2673 138.6123 27.7010 193.2077 64.2466 6.6796 23.0749 223.6665 2.1663 5.4102 32.2782 211.6735 207.8475 313.9478 238.4258 15.6191 31.3240 90.6631 240.1507 26.9924 88.5295 30.9496 18.9772 14.5795 14.9800 0.1201 2.3668 2.6360 2.3739 6.0650 0.7729 1.8226 10.9319 32.6607
temp: 298.150 k
press: 1.00000 atm
elementType: 17 8 8 7 7 7 6 6 6 6 6 6 6 6 6 6 6 6 6 6 1 1 1 1 1 1 1 1 1 1 1 1
symmnumber: 1
zpe: 623722.6 jmol-1
zpe.correction: 0.237563 hartree
zpe.thermalcorrener: 0.255882 hartree
zpe.thermalcorrenthalpy: 0.256827 hartree
zpe.thermalcorrgfe: 0.188399 hartree
zpe.sumelectzpe: -1314.048211 hartree
zpe.sumelectthermal: -1314.029892 hartree
zpe.sumelectthermalent: -1314.028948 hartree
zpe.sumelectthermalfe: -1314.097376 hartree
dipole: 1.7185 -0.9288 -0.7172
dipole: 2.0809
quadrupole: -136.0291 -120.5043 -125.3497
quadrupole: -10.5601 -0.4254 -0.1558
quadrupole: -8.7347 6.7901 1.9447 -10.5601 -0.4254 -0.1558
hfenergy: -1314.2857745 hartree
pointgroup: C01 [X(C14H12Cl1N3O2)]
dipole: 0.681225 -0.2963377 0.344075 debye
polarizability: 388.6249296|-0.1140088|80.9142202|-1.3744499|-5.2162381|176.4075306 unknown
InChI: InChI=1S/C14H12ClN3O2/c15-11-5-1-9(2-6-11)13(19)17-12-7-3-10(4-8-12)14(20)18-16/h1-8,17-18H,16H2
charge 0 multiplicity 1
32 atoms
Cl 7.538753 -0.19679 0.52547
O  1.180587 0.178938 -1.975294
O  -5.712618 -0.223631 1.584632
N  0.640126 -0.284108 0.263083
N  -5.851597 -0.345137 -0.727339
N  -7.272571 -0.371766 -0.740915
C  -0.779182 -0.262156 0.229419
C  -3.625957 -0.25682 0.326344
C  -1.528338 0.079512 -0.929309
C  -1.464255 -0.587669 1.434226
C  2.997642 -0.077024 -0.39069
C  -2.935487 0.081049 -0.866634
C  -2.866169 -0.580373 1.480139
C  1.541545 -0.041544 -0.778822
C  3.472838 0.146315 0.92911
C  3.936135 -0.308207 -1.429693
C  -5.122373 -0.266619 0.458861
C  4.854738 0.112525 1.213575
C  5.318412 -0.350496 -1.161185
C  5.757078 -0.145342 0.162838
H  -1.002668 0.337496 -1.84959
H  -0.892802 -0.843985 2.335933
H  1.045818 -0.55668 1.160944
H  -3.485541 0.388665 -1.76364
H  -3.404221 -0.815571 2.403857
H  2.787156 0.396333 1.747654
H  3.558551 -0.446456 -2.447602
H  5.222976 0.29477 2.226927
H  6.039873 -0.536205 -1.961732
H  -5.408274 -0.538194 -1.6251
H  -7.616648 -1.101574 -0.098609
H  -7.646727 0.545838 -0.458454
