program: Gaussian 09
title: 000180827
version: EM64L-G09RevD.01
frameworkgroup: C1[X(C20H32O5)]
method: RPBEPBE
basis: SDD
operation: Freq
keyword: #pfreq=noraman
keyword: PBEPBE/SDD
title: #p freq=noraman PBEPBE/SDD
converged: YES YES NO NO
title: Mulliken charges:
elementType: O O O O O C C C C C C C C C C C C C C C C C C C C H H H H H H H H H H H H H H H H H H H H H H H H H H H H H H H H
charge: -0.299918 -0.277585 -0.256067 -0.429327 -0.228160 0.181029 -0.414749 -0.386471 0.480543 -0.789729 -0.724376 -0.345776 -0.360191 -0.405563 -0.411749 -0.433185 -0.399505 0.374383 -0.697049 -0.254788 -0.318534 -0.291972 -0.298224 -0.365352 0.213840 0.194298 0.190731 0.212723 0.197979 0.214425 0.225954 0.217782 0.222410 0.214491 0.208286 0.184961 0.185644 0.194204 0.197676 0.250285 0.225569 0.262048 0.244863 0.209688 0.209114 0.215662 0.203902 0.224063 0.206607 0.212883 0.238135 0.224214 0.241695 0.225542 0.266375 0.234616 0.381651
chargesum: 0.00000
title: Mulliken charges with hydrogens summed into heavy atoms:
elementType: O O O O O C C C C C C C C C C C C C C C C C C C C
charge: -0.299918 -0.277585 -0.256067 -0.047676 -0.228160 0.181029 -0.029720 0.024232 0.480543 -0.131569 -0.079190 0.024829 0.031689 -0.155278 -0.186180 -0.171137 -0.154642 0.374383 -0.062585 0.173176 0.100956 0.170377 0.169013 0.135639 0.213840
polarizability: 2.77785409e+02 1.48387604e+01 2.05876824e+02 1.65139109e+01 8.64231498e+00 2.20109449e+02
1716.lowfreq: -0.0003 -0.0001 0.0004 1.3778 6.0265 9.2688 12.1778 19.6056 26.5529
frequency: 12.0962 19.5931 26.4656 30.6180 39.8569 43.5913 52.2828 57.8638 74.9116 81.4705 94.7862 105.4859 109.9590 120.4528 124.0201 126.2788 157.7506 194.3852 198.4440 216.9627 225.8574 233.6550 244.1494 250.1081 276.3350 277.9284 313.2101 325.3183 338.2951 350.6712 361.0974 385.4829 407.2891 415.5421 431.5487 442.0235 453.4088 467.1849 474.0232 491.3627 496.2377 540.6195 568.0216 599.9628 630.5706 636.3472 661.4951 724.3812 736.3507 750.2261 769.3242 778.9286 806.2860 818.3270 822.0307 825.2840 845.4897 856.7049 879.5952 896.7975 897.9694 918.8342 934.6473 944.4425 955.3568 961.0002 971.5798 988.2283 993.4006 1001.6845 1017.9510 1024.3505 1028.8289 1045.2174 1060.6443 1060.9415 1072.2220 1074.6038 1085.0880 1100.4757 1105.5161 1122.0355 1128.2795 1145.8106 1164.7503 1183.6041 1197.1384 1204.8590 1205.2716 1222.4085 1230.0990 1242.5169 1246.0424 1249.4816 1256.4556 1278.9173 1282.2874 1289.6554 1292.8870 1304.0569 1308.1576 1311.1548 1325.2609 1346.6509 1354.0318 1356.3040 1359.9714 1365.5622 1372.9199 1377.2787 1387.8504 1389.0764 1396.1731 1413.8742 1429.4654 1437.4778 1453.9120 1457.0515 1463.0427 1467.5549 1468.4538 1471.9496 1472.3889 1477.7916 1480.2769 1484.4949 1485.0626 1487.8056 1495.8675 1501.3929 1579.9709 1619.8569 1682.7026 2948.8013 2952.1292 2955.9111 2964.8236 2968.4730 2969.9370 2971.0219 2972.6558 2973.8179 2977.6815 2988.8908 3000.5389 3001.5833 3013.8417 3018.7888 3024.3922 3041.1662 3048.2372 3051.0289 3064.6574 3067.2315 3068.9223 3070.0681 3070.3390 3074.7421 3077.5843 3096.4228 3125.9739 3141.8243 3159.2840 3164.5657 3511.9120
redmass: 5.0123 4.7781 4.0319 4.8034 6.9120 4.4830 1.9555 3.5688 4.3011 2.9078 3.1423 4.1708 3.0314 3.0025 4.0078 1.9534 3.4309 3.4192 4.5747 2.8044 1.6116 1.1331 1.6273 2.6489 3.9494 4.4855 1.1002 3.1315 3.8904 2.8479 2.7373 2.7067 3.4009 2.9990 3.5176 3.2441 3.1887 2.6452 2.7983 2.3402 3.0588 3.0233 2.5028 5.0304 3.1364 1.8809 4.1904 1.0881 2.8673 1.2619 3.1842 2.1853 2.2616 1.8447 1.8452 1.5194 1.4596 1.9735 4.0829 1.8434 3.6064 1.7377 1.4791 1.4118 2.5436 1.3407 1.3523 2.5132 1.5961 2.7818 2.4484 2.7316 3.0381 2.8043 2.1830 3.4449 1.7682 2.0288 3.6026 2.1031 3.1205 2.2318 1.5160 1.9408 2.5181 1.5023 1.8470 1.1955 2.0945 2.1917 1.1895 1.5093 1.2961 1.5220 1.4231 1.1119 1.3794 1.0524 1.0942 1.3460 1.2978 1.3727 1.1905 1.4799 1.7228 2.2896 1.4017 1.2766 1.8191 1.2351 1.2480 1.2175 1.2269 3.2698 1.0839 1.0840 1.1024 1.0718 1.0711 1.0629 1.0695 1.0708 1.0760 1.0427 1.0754 1.0857 1.0518 1.0856 1.0616 2.2557 6.9691 6.3131 8.6848 1.0588 1.0568 1.0587 1.0590 1.0630 1.0366 1.0364 1.0564 1.0608 1.0372 1.0976 1.0578 1.0996 1.0568 1.1033 1.1037 1.1044 1.1040 1.0966 1.0998 1.1007 1.1068 1.0991 1.0992 1.0998 1.0989 1.1107 1.0876 1.0880 1.0939 1.0955 1.0642
irintensity: 0.0049 0.3874 0.6646 0.3113 0.0537 1.1534 0.1486 0.1939 1.2355 0.9691 0.6418 0.3366 0.8691 3.0907 1.2360 0.3001 1.8868 0.4919 4.8865 0.5593 0.2223 0.0708 1.0281 3.5390 2.0370 9.5729 0.0361 2.0990 3.7079 0.5750 1.1789 10.8861 0.2166 0.1098 0.4269 3.6372 15.1271 12.8647 3.2739 23.2988 5.0393 7.7427 12.7498 23.0657 68.2281 117.0654 14.0186 10.7089 2.0675 0.9368 11.6862 6.0787 13.2452 23.3477 6.4712 5.7947 37.3984 0.4785 22.1455 9.7458 57.9655 2.3172 0.7638 2.9547 34.1637 0.1183 1.6562 122.8940 1.3375 12.6925 1.4898 162.2632 52.8804 47.1393 2.1950 26.1770 2.2981 2.2300 9.3238 10.9114 60.6910 1.0981 6.7339 23.5757 3.3386 158.0362 2.1450 6.6349 3.7947 118.9318 23.3668 8.1805 3.5147 5.4513 8.9340 6.2687 6.7986 0.1179 0.5399 1.5123 16.2125 10.4229 1.4380 2.5953 0.8180 3.2475 8.4174 17.8315 5.5622 26.4719 9.5118 12.3619 18.6617 1.6657 23.3989 7.7313 47.4968 0.5004 0.2030 0.5589 5.0314 7.0452 4.2320 12.0574 2.0242 7.8934 11.4057 16.0900 13.2623 140.4341 2.6158 33.8229 200.1666 5.6756 29.6381 27.9920 15.2592 32.8092 21.4035 42.8433 98.8360 45.3534 31.1684 2.2052 13.3468 9.3068 40.8460 0.7368 43.6191 86.4839 34.0370 13.0205 8.5877 75.1047 3.8182 102.4446 48.2873 40.5232 46.7862 38.4009 20.6462 4.9253 18.8845 0.8059 22.5079
temp: 298.150 k
press: 1.00000 atm
elementType: 8 8 8 8 8 6 6 6 6 6 6 6 6 6 6 6 6 6 6 6 6 6 6 6 6 1 1 1 1 1 1 1 1 1 1 1 1 1 1 1 1 1 1 1 1 1 1 1 1 1 1 1 1 1 1 1 1
symmnumber: 1
zpe: 1275233.1 jmol-1
zpe.correction: 0.485711 hartree
zpe.thermalcorrener: 0.514284 hartree
zpe.thermalcorrenthalpy: 0.515229 hartree
zpe.thermalcorrgfe: 0.422661 hartree
zpe.sumelectzpe: -1155.427969 hartree
zpe.sumelectthermal: -1155.399395 hartree
zpe.sumelectthermalent: -1155.398451 hartree
zpe.sumelectthermalfe: -1155.491018 hartree
dipole: -2.9396 -2.3277 0.2556
dipole: 3.7583
quadrupole: -167.3452 -155.4300 -140.8528
quadrupole: -8.1114 -0.0426 1.1905
quadrupole: -12.8025 -0.8874 13.6899 -8.1114 -0.0426 1.1905
hfenergy: -1155.9136798 hartree
pointgroup: C01 [X(C20H32O5)]
dipole: 1.1342594 -0.5226451 0.7916241 debye
polarizability: 268.928432|10.224044|207.2768665|27.7087703|12.5712201|227.5663835 unknown
InChI: InChI=1S/C20H32O5/c1-4-5-6-11-20(2,3)17-7-9-18(10-8-17)25-15-14-23-12-13-24-16-19(21)22/h7-10,21H,4-6,11-16H2,1-3H3
charge 0 multiplicity 1
57 atoms
O  -1.877639 -1.464333 -0.841575
O  -3.886093 -1.249667 -3.264339
O  -4.264226 2.001125 -1.36855
O  -3.701919 1.005959 2.147859
O  -5.244706 0.106202 0.658824
C  3.254325 -0.579175 1.760776
C  4.298213 0.016772 0.753401
C  3.941769 1.38911 0.139692
C  1.892395 -0.801676 1.06087
C  3.1364 0.356098 2.992739
C  3.793778 -1.955798 2.258216
C  4.977569 1.854778 -0.909143
C  4.648825 3.236626 -1.519129
C  0.675136 -0.251412 1.543976
C  1.813907 -1.603027 -0.10793
C  -0.556436 -0.485638 0.899373
C  0.593821 -1.849725 -0.774185
C  -0.602329 -1.287348 -0.264592
C  5.684785 3.69567 -2.56794
C  -1.97139 -2.324244 -2.03567
C  -3.434013 -2.399833 -2.477934
C  -4.571108 -0.179358 -2.511585
C  -3.583118 0.954222 -2.17359
C  -3.833502 2.073906 0.006441
C  -4.363478 0.950288 0.906537
H  5.272405 0.094082 1.280621
H  4.454081 -0.70842 -0.071597
H  2.941024 1.332958 -0.333634
H  3.871397 2.155591 0.937701
H  2.494673 -0.08749 3.776512
H  2.724062 1.346778 2.731475
H  4.138551 0.515002 3.432419
H  3.087716 -2.420967 2.970313
H  3.940232 -2.659946 1.419138
H  4.767437 -1.826441 2.768211
H  5.985567 1.891937 -0.444117
H  5.039805 1.102351 -1.723645
H  4.587193 3.987882 -0.705163
H  3.641855 3.19857 -1.982501
H  0.674408 0.374062 2.441382
H  2.725492 -2.049995 -0.521794
H  -1.484841 -0.059742 1.29481
H  0.590884 -2.471806 -1.674081
H  5.744096 2.977219 -3.407496
H  6.694323 3.771379 -2.121035
H  5.426253 4.685192 -2.987969
H  -1.605366 -3.341792 -1.781454
H  -1.352773 -1.910265 -2.857341
H  -4.082055 -2.55734 -1.591223
H  -3.539101 -3.269553 -3.154069
H  -5.032416 -0.570809 -1.586856
H  -5.366858 0.195763 -3.177755
H  -2.714297 0.542746 -1.627547
H  -3.23724 1.449559 -3.097738
H  -4.227125 3.027902 0.403661
H  -2.728325 2.09713 0.107208
H  -4.078823 0.312641 2.755318
