program: Gaussian 09
title: 000180806
version: EM64L-G09RevD.01
frameworkgroup: C1[X(C16H9BrClF5N2O2S)]
method: RPBEPBE
basis: SDD
operation: Freq
keyword: #p
keyword: freq=noraman
keyword: PBEPBE/SDD
title: #p freq=noraman PBEPBE/SDD
converged: YES YES NO NO
title: Mulliken charges:
elementType: Br Cl S F F F F F O O N N C C C C C C C C C C C C C C C C H H H H H H H H H
charge: 0.023692 0.043381 0.275011 -0.134856 -0.153392 -0.217084 -0.155274 -0.152043 -0.200781 -0.151863 -0.489858 -0.490981 0.646221 -0.254252 -0.461240 -0.302334 -0.167269 -0.180297 0.110757 -0.096732 0.297595 0.222085 0.289032 0.258411 -0.242491 -0.374015 -0.379983 -0.145288 0.320159 0.275200 0.264841 0.300644 0.341558 0.291411 0.268993 0.270652 0.250392
chargesum: 0.00000
title: Mulliken charges with hydrogens summed into heavy atoms:
elementType: Br Cl S F F F F F O O N N C C C C C C C C C C C C C C C C
charge: 0.023692 0.043381 0.275011 -0.134856 -0.153392 -0.217084 -0.155274 -0.152043 -0.200781 -0.151863 -0.189214 -0.149423 0.646221 -0.254252 -0.461240 0.017824 0.107931 0.084543 0.110757 -0.096732 0.297595 0.222085 0.289032 0.258411 0.048920 -0.105023 -0.109330 0.105104
polarizability: 4.05592307e+02 -8.00412402e+00 2.35612683e+02 -2.03688606e+01 2.15057551e+01 1.50294116e+02
1716.lowfreq: -10.4371 -1.7078 -0.0005 0.0004 0.0005 2.3367 6.7108 10.5854 15.5815
frequency: -4.9166 10.5285 15.5185 19.2956 28.5562 34.6390 46.9855 52.5516 69.1976 75.9253 98.7028 115.4970 126.4509 130.8071 155.1834 167.1922 190.8926 205.3186 216.1788 227.6295 229.1954 254.7883 274.9342 288.5590 298.4769 323.4261 334.8579 342.6978 347.1795 381.2954 405.1641 416.2282 427.2815 440.9818 441.1626 475.6423 496.0783 517.3646 544.3638 562.1231 571.0061 574.3146 597.0113 620.7678 654.7473 660.9861 669.6937 687.0522 714.7626 715.7669 728.0595 731.9390 759.2015 760.4431 802.8935 826.1686 861.2243 882.5010 882.5189 891.3082 897.0796 936.0296 953.8460 968.6126 973.2740 983.3653 990.2303 1007.2238 1051.9340 1086.5575 1100.5659 1132.4759 1148.7667 1157.6780 1168.1174 1202.9629 1227.3433 1232.7959 1235.4616 1246.7276 1296.8996 1298.3311 1348.8493 1375.4808 1391.3993 1434.1219 1444.2865 1448.7502 1460.0993 1507.4811 1562.9527 1574.1434 1596.0715 1620.4786 1642.1326 1684.6451 3116.8160 3163.9440 3169.7988 3181.8415 3183.7119 3192.2243 3194.0735 3458.6449 3508.0730
redmass: 14.9189 12.1775 11.1230 12.6991 11.2457 13.2092 16.0896 11.6364 7.6766 8.0442 10.9545 8.8318 11.0319 16.6401 5.8786 8.4193 9.6882 12.2549 16.4963 13.8709 4.9088 9.1617 12.9508 12.1997 16.4884 11.8374 6.7643 17.6375 11.5327 10.8590 11.6547 7.9270 7.8508 5.3972 4.9554 4.9912 6.7299 9.3794 4.8403 5.6176 3.3091 5.1251 1.6869 6.6527 5.1558 2.6593 1.9546 9.4791 7.7110 5.8525 4.2528 5.7852 2.9882 4.1380 2.5716 6.5460 1.4017 1.4129 1.4222 6.5364 6.5041 7.6516 7.7000 1.3573 7.2291 11.1243 1.3325 5.3168 2.5796 2.5054 2.5062 6.8387 1.4076 2.3018 1.2017 2.6797 4.5580 2.8590 1.1631 1.4800 1.2956 1.7798 4.5306 11.0125 5.5134 2.7957 2.3857 3.1903 1.8515 2.6626 4.4000 7.0663 6.5083 8.4720 4.5312 6.7924 1.0880 1.0883 1.0908 1.0934 1.0932 1.0960 1.0998 1.0767 1.0775
irintensity: 0.7048 0.9469 0.2683 0.5426 0.7225 1.7802 0.6037 5.2990 5.4565 2.4449 0.9501 1.7713 0.9931 1.1969 1.8548 0.3610 6.9389 3.4188 2.1223 2.3609 0.0559 0.6071 2.4445 1.2398 2.0692 1.1302 4.9050 2.3934 7.9789 3.7780 2.2421 3.1514 0.4443 6.9596 5.4770 1.2915 3.1469 38.6349 11.9116 0.1745 13.4729 6.6291 28.9026 9.9020 15.2013 80.3940 51.3636 182.7226 29.8534 29.9076 12.3316 123.3027 9.4185 7.1066 80.9641 4.2260 32.2316 2.6072 1.7870 39.1212 73.7823 50.2605 54.1079 2.2428 32.0610 174.6912 5.4509 25.7672 7.8752 19.9480 24.4098 38.3047 0.1422 576.0953 109.4063 30.1290 282.6295 9.7589 5.3895 39.6938 10.7520 13.7146 222.7422 1.9394 13.1865 75.7786 76.6037 91.1182 1399.8034 227.0359 62.8902 37.3954 135.2444 105.7264 72.4789 222.0702 5.0446 4.2576 2.0850 0.8336 0.4587 12.7136 1.4876 53.1786 49.6546
temp: 298.150 k
press: 1.00000 atm
elementType: 35 17 16 9 9 9 9 9 8 8 7 7 6 6 6 6 6 6 6 6 6 6 6 6 6 6 6 6 1 1 1 1 1 1 1 1 1
symmnumber: 1
zpe: 591777.8 jmol-1
zpe.correction: 0.225396 hartree
zpe.thermalcorrener: 0.251631 hartree
zpe.thermalcorrenthalpy: 0.252575 hartree
zpe.thermalcorrgfe: 0.163103 hartree
zpe.sumelectzpe: -2243.840095 hartree
zpe.sumelectthermal: -2243.813860 hartree
zpe.sumelectthermalent: -2243.812916 hartree
zpe.sumelectthermalfe: -2243.902387 hartree
dipole: -4.5845 6.7033 2.8699
dipole: 8.6132
quadrupole: -144.7184 -192.1326 -186.7792
quadrupole: -10.4069 -25.9951 -3.1340
quadrupole: 29.8250 -17.5892 -12.2358 -10.4069 -25.9951 -3.1340
hfenergy: -2244.0654909 hartree
pointgroup: C01 [X(C16H9Br1Cl1F5N2O2S1)]
dipole: -1.7505757 -2.8281341 -0.648439 debye
polarizability: 405.6126996|15.2632349|240.8900425|13.3930321|6.7596425|144.9963632 unknown
InChI: InChI=1S/C16H9BrClF5N2O2S/c17-8-6-7(28-16(22,23)14(18)21)4-5-11(8)24-15(27)25-13(26)12-9(19)2-1-3-10(12)20/h1-6,14,24-25H
charge 0 multiplicity 1
37 atoms
Br 0.910454 -3.116912 0.67916
Cl 8.147195 0.540135 -2.430895
S  5.59652 0.081684 1.281393
F  5.583254 1.463531 -1.084256
F  5.495717 -0.795327 -1.319336
F  -4.198979 -2.095283 0.161659
F  -6.175174 2.275301 -0.629666
F  8.249627 1.039877 0.207887
O  -1.166712 1.951591 0.731774
O  -4.052559 1.904896 1.115243
N  -0.454653 -0.300286 0.64498
N  -2.690009 0.2009 0.231876
C  0.94153 -0.164164 0.787798
C  3.769577 -0.013346 1.051302
C  1.752442 -1.338005 0.821321
C  1.596068 1.095821 0.902432
C  3.148668 -1.278652 0.950209
C  2.99531 1.166543 1.03043
C  6.084095 0.252222 -0.535659
C  -5.12108 0.138037 -0.157978
C  -1.407167 0.734916 0.564843
C  -3.927103 0.846199 0.460612
C  -5.278948 -1.26616 -0.251672
C  -6.239196 0.883114 -0.623098
C  7.613592 0.140049 -0.701476
C  -6.426811 -1.915261 -0.722991
C  -7.4157 0.291435 -1.113996
C  -7.50836 -1.115935 -1.155059
H  0.986754 2.001193 0.896329
H  3.745032 -2.193559 0.964282
H  3.483003 2.141587 1.114549
H  -0.79242 -1.269278 0.635665
H  -2.730416 -0.734335 -0.183314
H  7.954886 -0.883653 -0.488132
H  -6.46371 -3.007056 -0.746587
H  -8.230782 0.93336 -1.457477
H  -8.419746 -1.591283 -1.528553
