program: Gaussian 09
title: 000180803
version: EM64L-G09RevD.01
frameworkgroup: C1[X(C16H9BrF6N2O2S)]
method: RPBEPBE
basis: SDD
operation: Freq
keyword: #p
keyword: freq=noraman
keyword: PBEPBE/SDD
title: #p freq=noraman PBEPBE/SDD
converged: YES YES NO NO
title: Mulliken charges:
elementType: Br S F F F F F F O O N N C C C C C C C C C C C C C C C C H H H H H H H H H
charge: 0.023250 0.264021 -0.133217 -0.159006 -0.157333 -0.207159 -0.173288 -0.164188 -0.199727 -0.151746 -0.493302 -0.486106 0.643903 -0.248688 -0.460668 -0.302499 -0.151568 -0.197434 0.034511 -0.113368 0.307295 0.236532 0.261005 0.281994 0.131780 -0.380724 -0.372510 -0.144910 0.319889 0.275692 0.264312 0.296464 0.334118 0.232895 0.270354 0.269223 0.250205
chargesum: 0.00000
title: Mulliken charges with hydrogens summed into heavy atoms:
elementType: Br S F F F F F F O O N N C C C C C C C C C C C C C C C C
charge: 0.023250 0.264021 -0.133217 -0.159006 -0.157333 -0.207159 -0.173288 -0.164188 -0.199727 -0.151746 -0.196838 -0.151988 0.643903 -0.248688 -0.460668 0.017389 0.124124 0.066877 0.034511 -0.113368 0.307295 0.236532 0.261005 0.281994 0.364675 -0.110370 -0.103287 0.105296
polarizability: 3.94285096e+02 -1.69474991e+01 2.16426492e+02 -3.12996767e+00 2.15748177e+01 1.45560544e+02
1716.lowfreq: -4.7323 -0.0013 0.0013 0.0014 2.5032 4.0756 6.3855 10.4355 16.1419
frequency: 6.1442 10.2205 16.0790 20.9038 26.2149 38.8567 48.7141 51.3407 68.5625 80.3433 84.5738 112.4307 128.1617 141.0002 147.6047 162.4798 195.2436 222.8157 228.5523 228.6529 242.3990 265.0383 282.1325 294.0472 300.1546 328.0362 334.4023 348.7895 380.8413 385.4118 409.5603 423.2351 436.8413 439.9683 473.3412 486.5112 498.7976 517.0527 548.5958 562.8275 572.1110 576.3094 590.6952 620.3750 654.7532 657.1165 670.2440 704.7661 717.3138 727.0388 737.5333 759.1392 764.8621 804.4370 827.3481 858.2265 881.9713 883.2855 889.5105 898.5373 941.4298 953.3640 969.1366 971.4349 986.7846 997.2606 1004.5519 1008.3335 1052.1179 1087.8491 1101.9209 1143.8996 1147.5852 1160.4500 1167.6854 1202.8708 1228.4891 1232.3231 1246.8251 1297.2033 1300.2400 1321.0538 1348.9722 1375.5278 1392.2798 1435.3250 1444.5665 1448.6682 1461.4476 1507.9136 1563.7222 1575.0645 1596.9204 1619.7111 1643.2190 1686.4494 3086.6040 3163.4418 3169.1018 3183.5172 3184.0309 3193.6011 3193.7942 3461.7594 3511.0278
redmass: 11.3308 15.9344 10.7330 11.5079 9.8720 12.6245 12.2593 13.8038 7.6640 8.2016 7.9026 13.5416 17.9785 6.9904 7.5651 7.6660 9.9858 10.2500 6.0616 8.7106 9.7653 15.2175 13.0412 10.4870 15.3114 9.4969 7.4946 11.8585 12.4589 11.9889 12.0161 6.1621 9.2790 3.5210 5.0685 9.9707 6.8386 9.0498 3.7277 5.8488 3.2687 5.0515 1.8301 8.6473 1.3225 7.8836 4.4529 6.6835 6.7771 4.4025 7.2019 3.2922 3.5709 2.5854 6.2903 1.3968 1.4535 1.3989 7.7502 6.9637 7.3059 9.4528 1.5367 4.4445 1.3442 9.0142 6.9897 5.5479 2.5571 2.5087 2.5104 3.5483 1.5967 2.4416 1.1857 2.6466 4.3737 2.9438 1.4784 1.8809 1.1502 1.3819 4.5110 11.1091 5.5950 2.8347 2.4081 3.1399 1.8253 2.6693 4.3771 7.0579 6.5663 8.4537 4.4115 7.0356 1.0879 1.0883 1.0910 1.0932 1.0933 1.0958 1.0997 1.0765 1.0773
irintensity: 1.1489 0.5462 0.2613 0.4577 3.1076 0.6305 2.2950 0.4833 9.1274 1.2960 1.3584 1.2931 0.4086 1.2866 2.0437 1.3302 8.5621 3.3678 1.0567 2.3959 0.4450 4.4299 3.9261 0.8933 2.0157 4.0560 2.1210 6.0046 9.3378 0.6648 0.5013 0.7320 0.8880 8.6843 0.9189 20.3813 3.7347 31.1279 12.3031 2.0167 12.7638 3.7551 25.9878 5.6811 74.2844 17.5788 3.3393 32.7733 26.3053 41.5350 117.1627 4.2162 30.1326 75.6460 2.2916 35.0036 3.1029 0.5627 203.8101 54.7357 64.9533 68.7276 6.6989 30.5175 1.6451 178.0403 27.7516 28.6882 6.2394 16.9348 15.1814 126.6809 21.4276 672.6529 96.5635 15.5495 256.7627 10.9698 40.0270 22.6631 5.9759 22.9399 208.4125 1.9885 12.3192 47.1502 62.4913 89.1702 1369.1174 242.2655 57.4609 41.7515 132.9054 108.8451 66.4137 236.4730 13.7355 4.3514 1.8277 0.5107 0.9237 12.9258 1.1228 58.3427 36.5894
temp: 298.150 k
press: 1.00000 atm
elementType: 35 16 9 9 9 9 9 9 8 8 7 7 6 6 6 6 6 6 6 6 6 6 6 6 6 6 6 6 1 1 1 1 1 1 1 1 1
symmnumber: 1
zpe: 595392.9 jmol-1
zpe.correction: 0.226773 hartree
zpe.thermalcorrener: 0.253652 hartree
zpe.thermalcorrenthalpy: 0.254596 hartree
zpe.thermalcorrgfe: 0.161616 hartree
zpe.sumelectzpe: -1883.621246 hartree
zpe.sumelectthermal: -1883.594368 hartree
zpe.sumelectthermalent: -1883.593423 hartree
zpe.sumelectthermalfe: -1883.686404 hartree
dipole: -4.5382 7.2340 -0.0817
dipole: 8.5400
quadrupole: -141.8473 -185.0532 -180.6000
quadrupole: -18.0164 -26.8144 -1.1505
quadrupole: 27.3195 -15.8864 -11.4331 -18.0164 -26.8144 -1.1505
hfenergy: -1883.8480195 hartree
pointgroup: C01 [X(C16H9Br1F6N2O2S1)]
dipole: -1.7714709 -2.2065185 -1.8116811 debye
polarizability: 393.5939715|22.2901228|164.34153|3.4136336|36.9812979|198.3366301 unknown
InChI: InChI=1S/C16H9BrF6N2O2S/c17-8-6-7(28-16(22,23)14(20)21)4-5-11(8)24-15(27)25-13(26)12-9(18)2-1-3-10(12)19/h1-6,14,24-25H
charge 0 multiplicity 1
37 atoms
Br 0.983732 -2.950813 -1.15544
S  5.654617 -0.404275 0.915899
F  5.527237 1.8502 -0.646683
F  5.489223 -0.10296 -1.809989
F  -6.436472 -0.465474 2.231255
F  -3.965491 0.210878 -1.898209
F  8.248476 1.050028 0.274016
F  7.894473 1.468286 -1.956784
O  -1.153081 1.097649 1.848337
O  -4.020912 0.897857 2.157545
N  -0.418695 -0.650035 0.438328
N  -2.686629 -0.136685 0.514975
C  0.981602 -0.551376 0.569839
C  3.818794 -0.44181 0.743172
C  1.808671 -1.509632 -0.089386
C  1.626176 0.465594 1.330836
C  3.209008 -1.470511 -0.009736
C  3.030004 0.519772 1.409872
C  6.066703 0.537634 -0.660117
C  -5.128614 -0.059852 0.224277
C  -1.389577 0.189557 1.020978
C  -3.914984 0.296261 1.065989
C  -6.373885 -0.357976 0.842396
C  -5.170857 -0.038085 -1.19195
C  7.59546 0.572629 -0.89916
C  -7.560911 -0.586221 0.126172
C  -6.322954 -0.249414 -1.960891
C  -7.531843 -0.521565 -1.283312
H  1.00675 1.195866 1.854047
H  3.815717 -2.21773 -0.52564
H  3.50954 1.312041 1.99136
H  -0.741025 -1.452613 -0.113543
H  -2.735069 -0.600058 -0.39693
H  7.997436 -0.423857 -1.150977
H  -8.478828 -0.812038 0.674656
H  -6.265259 -0.198855 -3.050949
H  -8.449036 -0.689319 -1.85495
