program: Gaussian 09
title: 000016441
version: EM64L-G09RevD.01
frameworkgroup: C1[X(C10H14O)]
method: RPBEPBE
basis: SDD
operation: Freq
keyword: #pfreq=noraman
keyword: PBEPBE/SDD
title: #p freq=noraman PBEPBE/SDD
converged: YES YES NO NO
title: Mulliken charges:
elementType: O C C C C C C C C C C H H H H H H H H H H H H H H
charge: -0.213532 -0.167782 -0.471968 -0.487328 -0.518997 0.509995 0.399849 -0.354134 -0.836683 -0.732230 -0.230600 0.214823 0.217700 0.221723 0.233191 0.240546 0.249858 0.229857 0.217180 0.227532 0.225845 0.229198 0.219314 0.212421 0.164221
chargesum: 0.00000
title: Mulliken charges with hydrogens summed into heavy atoms:
elementType: O C C C C C C C C C C
charge: -0.213532 0.047041 -0.032545 -0.013591 -0.039282 0.509995 0.399849 -0.136954 -0.154108 -0.300495 -0.066379
polarizability: 1.42931402e+02 1.23861621e+01 9.89691988e+01 4.50585855e+00 2.48185725e+00 8.49396811e+01
1716.lowfreq: -21.0127 -7.7632 0.0003 0.0003 0.0006 10.3297 13.5704 55.8070 136.4467
frequency: -20.6099 55.7198 136.4411 145.1580 169.5271 197.8569 229.3979 275.9878 286.3006 316.9972 414.5432 432.4006 480.3324 512.8437 524.7822 568.4946 680.2921 707.3934 762.6776 788.9024 807.3432 890.8445 916.8041 928.6742 938.7615 971.7723 976.7571 993.0566 1001.6949 1047.8328 1054.1663 1070.4559 1118.9550 1136.8338 1172.4355 1206.5963 1229.3785 1253.7393 1299.6879 1307.1625 1313.6507 1330.9124 1361.9634 1369.8422 1392.3516 1394.6470 1427.3896 1439.4795 1455.6359 1460.9051 1467.0390 1473.5536 1596.6329 1650.2400 1667.8577 2854.9750 2959.2563 2960.8878 2968.3413 2978.2947 2989.9700 3010.8688 3032.5195 3036.4937 3054.0796 3082.0946 3084.9965 3088.9706 3187.2070
redmass: 2.8670 4.4661 3.6117 3.5491 1.8772 1.1986 3.3993 3.9138 2.5552 1.9315 2.3901 2.3496 2.5238 2.8759 2.9509 3.9921 3.0095 1.1870 3.4041 1.5403 1.3949 2.8543 1.5037 1.3386 2.2138 1.7519 2.0431 2.1515 1.4794 1.6136 2.1018 1.9716 2.5059 1.2470 1.7458 1.5439 1.4350 1.5318 1.3460 1.2989 1.6790 1.3023 1.7961 1.5702 1.2264 1.7589 1.1690 1.0975 1.0853 1.0503 1.0866 1.0622 7.9483 6.2756 4.7518 1.0849 1.0577 1.0479 1.0754 1.0653 1.0635 1.0961 1.0966 1.0937 1.1025 1.0899 1.0969 1.0641 1.1134
irintensity: 0.6417 1.9621 4.9776 3.7323 0.3603 0.9924 5.6607 2.3817 1.3180 8.5076 5.0484 1.7101 1.1241 4.4328 2.5992 1.3389 12.1800 1.4644 12.5760 3.6624 13.1792 0.5642 6.8552 68.4269 9.7584 8.6228 11.5741 7.5054 3.3162 0.1647 2.1576 0.5813 4.8542 2.1706 31.4074 4.7444 10.4426 3.4759 0.3915 6.7414 22.4143 0.5621 2.2595 0.7611 15.8882 26.9405 0.3844 20.1998 13.9509 13.5282 9.8626 24.4580 231.3949 73.4712 21.5815 124.5728 10.0833 15.6204 26.5188 14.2878 24.6447 27.7999 21.3028 16.0529 41.3964 28.6207 34.2850 4.8399 32.0824
temp: 298.150 k
press: 1.00000 atm
elementType: 8 6 6 6 6 6 6 6 6 6 6 1 1 1 1 1 1 1 1 1 1 1 1 1 1
symmnumber: 1
zpe: 556862.0 jmol-1
zpe.correction: 0.212098 hartree
zpe.thermalcorrener: 0.222615 hartree
zpe.thermalcorrenthalpy: 0.223559 hartree
zpe.thermalcorrgfe: 0.176225 hartree
zpe.sumelectzpe: -463.806199 hartree
zpe.sumelectthermal: -463.795681 hartree
zpe.sumelectthermalent: -463.794737 hartree
zpe.sumelectthermalfe: -463.842071 hartree
dipole: 3.6600 1.7991 -0.5798
dipole: 4.1193
quadrupole: -84.3140 -64.5842 -65.7024
quadrupole: -7.8751 -1.2676 0.3681
quadrupole: -12.7804 6.9493 5.8312 -7.8751 -1.2676 0.3681
hfenergy: -464.0182962 hartree
pointgroup: C01 [X(C10H14O1)]
dipole: 1.4384838 -0.7347829 0.1317657 debye
dipolederiv: -0.9951727 0.2168289 0.0322612 0.4439935 -0.6424245 -0.0245761 0.037717 -0.0126423 -0.3413294 -0.1245962 0.0054537 -0.0512668 0.0734997 0.0657388 -0.0127552 -0.0820043 0.0141581 0.1570775 0.0575642 0.0297566 0.0175462 -0.0574635 0.0736493 0.0454176 0.0422729 0.0091067 0.0799171 -0.2271716 0.0208166 0.0387683 0.1702131 0.0007666 -0.043659 0.1648031 -0.0744133 0.1145646 -0.0397273 -0.005121 0.0186349 0.026953 -0.0660061 -0.0061299 -0.0463345 -0.0157374 0.1811995 0.4155448 0.0234004 0.0176182 0.0181913 -0.0940215 0.1070182 -0.0157595 0.0891466 0.280565 -0.8615254 0.2811912 0.0565783 0.2797971 0.0921102 -0.0083151 0.0765488 0.0075063 -0.0557387 0.4990244 -0.0942908 -0.038803 -0.3354656 0.1135311 0.0308321 -0.0977216 0.0259957 -0.1699294 -0.0479992 -0.0182429 -0.0477468 -0.0240358 0.0791374 -0.0516077 -0.0661601 -0.0494392 -0.093274 -0.089299 0.0546536 0.0683253 0.0464474 -0.4123047 0.0348864 0.1280075 0.0392777 -0.2493929 1.5075271 -0.3472444 -0.0736184 -0.1764957 0.7376569 0.0193704 -0.0678739 0.024423 0.1036552 0.0529797 0.0050154 0.0343341 -0.0124806 0.011158 -0.0284098 0.0048873 -0.021354 -0.164244 0.037242 0.0160577 0.0256283 0.0352032 0.0622334 -0.067835 0.0157728 -0.0022324 -0.135152 0.0008201 -0.1121479 -0.0116999 -0.1089883 -0.1238783 -0.0071989 -0.0135592 -0.0378252 0.0687115 0.0053039 0.0689776 -0.0476869 -0.0095764 -0.0403422 0.084523 -0.0872698 0.1260665 0.0214636 0.0033804 0.0527399 0.0567951 -0.04144 0.0957262 -0.0239107 0.0243375 -0.0770224 -0.0692897 -0.0154925 0.0666462 -0.0554129 0.0350756 0.0174397 0.058372 -0.0453891 0.0861308 0.031534 0.064314 -0.0482926 0.003054 -0.0236449 0.0190003 -0.0551193 0.037447 -0.0884998 -0.0924737 -0.0568021 -0.123779 0.0060068 -0.1098311 -0.0746237 0.0014549 0.0008779 0.0077091 0.1468185 0.0802072 0.081643 -0.0033015 0.0382808 -0.0838006 -0.1174801 0.0087217 -0.0717076 0.0300401 0.0922469 -0.0580984 0.0029168 -0.0109904 -0.0074283 0.1324666 0.0027319 0.0880969 -0.0680105 -0.1812918 -0.0205822 0.00636 -0.0052958 0.1068648 -0.0084138 0.0882354 -0.0018548 0.0629819 -0.1500235 -0.0129036 0.0531887 -0.0262081 0.1750601 -0.0155277 0.0140488 -0.019118 0.0849563 -0.0030761 -0.0439671 -0.1172733 -0.0389802 0.1554834 -0.0527279 -0.1245588 -0.047625 -0.022986 -0.0239772 -0.038511 0.0087933 -0.1867581 -0.2607262 0.0093249 0.0002212 0.0018541 0.0983356 unknown
polarizability: 142.8467442|-11.8014092|98.1592791|-6.1828775|4.2330453|85.8342584 unknown
InChI: InChI=1S/C10H14O/c1-8(2)10-5-3-9(7-11)4-6-10/h3,7,10H,1,4-6H2,2H3
charge 0 multiplicity 1
25 atoms
O  -4.048337 0.641141 0.149441
C  1.109949 0.010761 0.293893
C  0.321642 1.13987 -0.432741
C  0.48147 -1.368076 -0.055834
C  -1.154284 1.1774 0.02178
C  2.61535 0.060366 -0.002757
C  -1.77605 -0.206759 0.045628
C  -1.026635 -1.353625 -0.000307
C  3.513323 0.401222 1.17266
C  3.116315 -0.164224 -1.246935
C  -3.246729 -0.334696 0.111439
H  0.968967 0.16914 1.383724
H  0.376994 0.966664 -1.525341
H  0.803141 2.116761 -0.24078
H  0.876817 -2.152594 0.620498
H  0.801523 -1.678171 -1.073263
H  -1.757638 1.831931 -0.63488
H  -1.236643 1.625227 1.033058
H  -1.54435 -2.326106 -0.003132
H  3.242354 1.385881 1.603191
H  3.397839 -0.340739 1.98766
H  4.578062 0.434105 0.884671
H  4.19208 -0.111776 -1.449153
H  2.473434 -0.400542 -2.103853
H  -3.627596 -1.389461 0.125533
