program: Gaussian 09
title: 000180792
version: EM64L-G09RevD.01
frameworkgroup: C1[X(C16H29FO)]
method: RPBEPBE
basis: SDD
operation: Freq
keyword: #p
keyword: freq=noraman
keyword: PBEPBE/SDD
title: #p freq=noraman PBEPBE/SDD
converged: YES YES NO NO
title: Mulliken charges:
elementType: F O C C C C C C C C C C C C C C C C H H H H H H H H H H H H H H H H H H H H H H H H H H H H H
charge: -0.212499 -0.155654 -0.382763 -0.372371 -0.384059 -0.367084 -0.363634 -0.391643 -0.391904 -0.475323 -0.478478 -0.186082 -0.469622 -0.353120 -0.183220 -0.345223 0.247748 -0.687234 0.194081 0.194151 0.189342 0.191590 0.198142 0.197270 0.210393 0.187610 0.195955 0.197901 0.200681 0.193629 0.217934 0.233311 0.205317 0.200889 0.244253 0.238692 0.222421 0.198786 0.204705 0.188070 0.195508 0.221486 0.189568 0.212162 0.208134 0.207575 0.212610
chargesum: 0.00000
title: Mulliken charges with hydrogens summed into heavy atoms:
elementType: F O C C C C C C C C C C C C C C C C
charge: -0.212499 -0.155654 0.005469 0.008562 0.011353 0.030918 0.030222 0.002667 0.059342 -0.069117 0.004466 0.036338 -0.066131 0.030458 0.038266 0.056507 0.247748 -0.058915
polarizability: 2.11941312e+02 2.41581944e+00 1.79166794e+02 1.34640149e+00 -4.46722623e+00 1.46308441e+02
1716.lowfreq: -4.0534 -0.0009 -0.0005 0.0008 0.9551 6.1476 13.8440 16.8687 17.8276
frequency: 12.9701 16.4804 17.5314 32.3314 38.4885 53.0937 60.6264 64.2269 71.9629 94.1964 108.2245 110.6807 127.6964 143.6221 150.9526 167.2379 182.6049 191.6470 219.7118 227.6309 257.3675 298.1165 310.0291 347.0230 394.6089 415.6312 449.1352 467.4999 481.9785 506.9653 549.4460 654.0571 722.6570 727.7900 733.1036 738.6225 753.2428 775.4807 795.7715 815.3382 844.0959 851.1930 866.7047 908.1973 925.8364 953.6783 966.1579 978.4885 984.1951 995.0102 1009.1229 1015.3162 1032.6198 1042.6176 1053.6793 1064.7185 1074.3981 1079.0033 1080.9752 1094.6684 1102.7650 1116.3672 1158.6181 1163.3314 1179.5676 1202.7226 1208.3180 1219.2734 1228.6136 1243.2073 1252.3298 1268.3826 1275.7115 1282.3951 1283.9709 1285.1724 1290.8283 1292.7058 1296.0611 1300.0926 1300.6167 1314.8547 1317.5306 1338.6768 1341.9809 1353.7458 1354.7778 1356.7077 1360.1114 1387.2681 1448.9788 1456.9189 1459.4805 1460.5003 1461.0333 1462.7738 1464.9391 1466.7577 1472.7508 1474.7855 1476.8140 1482.9234 1485.3316 1488.3802 1684.2034 1765.7997 2949.8810 2951.6775 2951.7652 2953.2614 2955.5381 2959.0819 2961.3361 2963.8539 2966.9670 2969.0146 2970.0179 2984.7333 2990.5746 2993.2247 3001.2952 3001.4883 3010.6608 3012.0090 3016.2650 3019.7116 3030.5527 3031.3884 3041.2625 3057.2243 3057.5252 3066.0027 3067.7892 3068.3523 3091.0551
redmass: 4.9653 5.0534 3.8146 4.4901 4.3600 2.9665 2.5670 2.3321 1.9720 2.3364 2.0593 3.8644 2.0837 1.9428 2.1126 5.0377 3.2100 2.4684 1.5968 1.4886 2.2663 3.8953 3.4986 2.4256 3.1538 3.0975 3.2143 2.6074 2.5110 2.4992 6.7618 6.5417 1.0722 1.1129 1.1550 1.8317 1.5055 1.4286 1.4111 1.9488 1.4159 1.4364 1.9541 1.5294 1.5036 2.0727 1.5718 1.2179 3.1184 2.7118 1.5506 3.2361 2.3505 2.1413 2.4435 2.0168 2.3210 2.4844 2.3217 2.5378 2.0491 2.0154 2.2009 1.8301 1.4246 1.3597 1.5053 1.2849 1.3350 1.3554 1.2968 1.2685 1.2340 1.0583 1.2095 1.1944 1.1292 1.1696 1.1314 1.1402 1.2461 1.2978 1.3279 1.3809 1.4505 1.4882 1.5408 1.6588 1.5794 1.2143 1.0937 1.0935 1.0892 1.0795 1.0735 1.0730 1.0711 1.0818 1.0682 1.0908 1.0426 1.0957 1.0804 1.1002 6.6117 12.0159 1.0588 1.0592 1.0598 1.0595 1.0594 1.0609 1.0605 1.0601 1.0593 1.0595 1.0382 1.0962 1.0673 1.0920 1.0993 1.0979 1.0602 1.1011 1.0986 1.1000 1.1038 1.1024 1.1041 1.0943 1.1025 1.0953 1.0931 1.0989 1.1027
irintensity: 0.4274 0.4309 0.5240 0.9318 0.8740 0.7013 0.3863 0.5364 0.1249 0.3862 0.3616 1.1419 0.0562 0.0386 0.1726 0.2782 2.6734 1.4627 0.3216 0.1197 0.3182 1.5452 1.2153 0.7904 0.5090 0.1518 0.3915 0.1435 0.1882 2.8016 16.8448 1.8084 18.8022 1.1867 2.6215 36.8223 33.0122 10.3036 6.8970 0.0155 6.2590 2.3993 2.3381 1.2446 9.1358 4.8557 8.5515 55.2520 3.1418 10.8262 6.4985 11.9063 6.6696 11.4795 43.5243 2.2919 10.7641 1.0410 0.7339 2.3525 1.6713 0.8466 52.0224 21.4012 8.2620 5.2072 4.7266 14.5015 0.6005 5.0361 4.6809 1.4320 5.5360 0.8513 1.8699 1.5326 3.3462 0.7586 0.2091 2.0153 1.4863 2.2710 0.5565 2.7183 1.9508 2.7534 0.6543 0.1497 1.7295 11.1482 6.2231 14.2303 12.6748 1.7209 0.3172 1.2849 1.8663 0.2512 1.9310 2.8370 11.3807 2.4528 7.5225 33.0593 0.0278 306.5773 0.7847 8.2772 20.9991 10.8616 2.7665 13.4417 32.7653 15.4849 217.9730 62.6310 24.8424 0.3253 22.1506 6.3772 1.2001 7.9310 15.0049 21.6032 28.1142 13.0890 4.2499 41.5687 170.7546 1.8072 51.3791 8.1310 159.4737 59.2141 29.3101
temp: 298.150 k
press: 1.00000 atm
elementType: 9 8 6 6 6 6 6 6 6 6 6 6 6 6 6 6 6 6 1 1 1 1 1 1 1 1 1 1 1 1 1 1 1 1 1 1 1 1 1 1 1 1 1 1 1 1 1
symmnumber: 1
zpe: 1090330.6 jmol-1
zpe.correction: 0.415285 hartree
zpe.thermalcorrener: 0.438382 hartree
zpe.thermalcorrenthalpy: 0.439326 hartree
zpe.thermalcorrgfe: 0.356624 hartree
zpe.sumelectzpe: -800.692159 hartree
zpe.sumelectthermal: -800.669061 hartree
zpe.sumelectthermalent: -800.668117 hartree
zpe.sumelectthermalfe: -800.750820 hartree
dipole: 3.9291 0.0224 -1.0431
dipole: 4.0653
quadrupole: -162.9064 -110.2238 -112.9174
quadrupole: 2.0929 6.1251 -0.8951
quadrupole: -34.2238 18.4587 15.7651 2.0929 6.1251 -0.8951
hfenergy: -801.1074436 hartree
pointgroup: C01 [X(C16H29F1O1)]
dipole: -1.5435821 0.058345 0.4147468 debye
polarizability: 211.9033068|-2.6162124|179.7279523|1.2808377|1.6972407|145.785288 unknown
InChI: InChI=1S/C16H29FO/c1-2-3-4-5-6-7-8-9-10-11-12-13-14-15-16(17)18/h5-6H,2-4,7-15H2,1H3
charge 0 multiplicity 1
47 atoms
F  6.935209 0.753963 -1.506311
O  7.948697 0.292704 0.516665
C  0.634048 -0.839802 0.458226
C  -0.374691 -1.901268 -0.035846
C  2.072983 -1.084949 -0.048953
C  -1.820888 -1.634416 0.436836
C  3.083183 -0.030024 0.455668
C  -2.823487 -2.709832 -0.036478
C  4.511721 -0.271923 -0.079021
C  -4.294132 -2.409252 0.371425
C  5.509968 0.79861 0.450511
C  -4.865852 -1.188498 -0.32165
C  -5.930399 1.135462 -0.398371
C  -5.204712 2.458064 -0.021304
C  -5.356924 -0.082916 0.297471
C  -3.73417 2.515098 -0.492456
C  6.909604 0.583448 -0.060397
C  -3.036555 3.839299 -0.113769
H  0.632283 -0.821942 1.568245
H  0.295447 0.16554 0.130689
H  -0.050641 -2.904793 0.312157
H  -0.354414 -1.936618 -1.145417
H  2.073415 -1.0917 -1.158766
H  2.406794 -2.094752 0.2687
H  -2.152891 -0.641562 0.070527
H  -1.842969 -1.57906 1.545829
H  2.741302 0.98043 0.148653
H  3.094245 -0.034537 1.565409
H  -2.527971 -3.695647 0.377388
H  -2.765934 -2.80439 -1.141165
H  4.856011 -1.279915 0.224804
H  4.508615 -0.248298 -1.184481
H  -4.913345 -3.296224 0.120812
H  -4.354419 -2.278741 1.470457
H  5.167737 1.79668 0.117509
H  5.540093 0.787227 1.553534
H  -4.868353 -1.221272 -1.424246
H  -5.890092 0.991241 -1.496559
H  -7.003028 1.238907 -0.129575
H  -5.241605 2.593986 1.080047
H  -5.761161 3.311847 -0.459802
H  -5.345715 -0.045099 1.39991
H  -3.701665 2.377836 -1.593108
H  -3.179825 1.659668 -0.057761
H  -3.026578 3.982304 0.983518
H  -3.560822 4.706398 -0.558665
H  -1.988813 3.861319 -0.466687
