program: Gaussian 09
title: 000180756
version: EM64L-G09RevD.01
frameworkgroup: C1[X(C9H9NO)]
method: RPBEPBE
basis: SDD
operation: Freq
keyword: #pfreq=noraman
keyword: PBEPBE/SDD
title: #p freq=noraman PBEPBE/SDD
converged: YES YES NO NO
title: Mulliken charges:
elementType: O N C C C C C C C C C H H H H H H H H H
charge: -0.246498 0.001139 0.277740 0.099973 -0.265898 -0.436644 -0.271718 -0.181188 -0.094251 -0.337220 -0.743264 0.288393 0.241132 0.218960 0.236723 0.259922 0.247488 0.237514 0.230186 0.237511
chargesum: 0.00000
title: Mulliken charges with hydrogens summed into heavy atoms:
elementType: O N C C C C C C C C C
charge: -0.246498 0.001139 0.277740 0.099973 0.022496 -0.195512 -0.052758 0.055535 0.165671 -0.089732 -0.038054
polarizability: 1.80522457e+02 4.63961427e-02 1.03518585e+02 1.68534275e-01 4.43577423e-02 4.76352050e+01
1716.lowfreq: -0.0011 -0.0010 -0.0010 3.7229 7.0103 11.2729 23.9813 68.8419 114.8877
frequency: 23.4293 68.7972 114.8874 155.4191 194.2178 201.6176 255.4557 318.9366 372.4889 399.8477 432.7651 469.5680 607.6790 680.2013 685.1522 714.2382 813.9880 820.6141 861.8203 916.9097 917.5541 964.5046 981.6935 999.7265 1014.0371 1021.3885 1053.6545 1056.8120 1100.5100 1126.7741 1194.0316 1236.1491 1294.2659 1309.7402 1314.7191 1348.3927 1393.7160 1405.1842 1455.5002 1458.9460 1466.5458 1524.4794 1560.5662 1582.5083 1655.2304 2968.3759 3040.0963 3084.4012 3107.6347 3132.9523 3135.3425 3148.0246 3152.7525 3171.5266
redmass: 3.7730 2.0675 3.8430 2.4751 1.5975 2.4386 4.8133 5.0885 2.8030 4.7125 4.4572 5.2458 7.9157 3.0797 7.0535 1.7999 1.4963 5.1342 2.1174 1.7127 1.6242 1.4552 1.0972 3.8079 1.3778 4.0898 2.0918 1.6126 1.6299 2.2535 1.3942 1.8500 1.4119 4.5750 2.0429 1.4757 1.2287 1.9930 1.0477 1.4412 1.4174 6.8615 6.7145 6.1469 5.5649 1.0374 1.0953 1.0964 1.0934 1.0891 1.0909 1.0895 1.0914 1.1001
irintensity: 6.4908 0.3177 1.8786 2.4221 0.4098 0.0179 11.8628 0.0437 0.9492 4.7670 1.5318 1.7048 2.6950 8.4517 12.1887 41.3286 29.5494 8.1781 2.1621 48.7131 31.2845 0.2988 58.1965 6.8043 1.4110 0.6154 12.8438 0.2856 23.1842 3.2863 1.8490 83.6799 83.4628 44.8542 39.6953 28.5230 17.3364 24.9150 17.3390 35.2327 33.9769 59.0631 79.3537 63.3911 188.5164 14.2979 14.9527 9.8657 12.5349 18.1457 0.4935 28.2573 5.6079 21.6566
temp: 298.150 k
press: 1.00000 atm
elementType: 8 7 6 6 6 6 6 6 6 6 6 1 1 1 1 1 1 1 1 1
symmnumber: 1
zpe: 409635.9 jmol-1
zpe.correction: 0.156022 hartree
zpe.thermalcorrener: 0.166288 hartree
zpe.thermalcorrenthalpy: 0.167232 hartree
zpe.thermalcorrgfe: 0.118875 hartree
zpe.sumelectzpe: -477.518610 hartree
zpe.sumelectthermal: -477.508344 hartree
zpe.sumelectthermalent: -477.507400 hartree
zpe.sumelectthermalfe: -477.555757 hartree
dipole: -1.1801 -0.6030 0.0343
dipole: 1.3256
quadrupole: -46.6865 -71.1260 -67.1601
quadrupole: 11.1363 0.0535 0.0246
quadrupole: 14.9711 -9.4685 -5.5025 11.1363 0.0535 0.0246
hfenergy: -477.6746319 hartree
pointgroup: C01 [X(C9H9N1O1)]
dipole: 0.4579231 0.248969 0.0182935 debye
dipolederiv: -0.7905394 0.0914711 0.0054017 -0.0874325 -0.8728672 -0.0194772 -0.0026912 -0.0203519 -0.3337803 -0.5667848 -0.0289151 0.0022675 -0.0566465 -0.3146246 -0.00102 0.001932 -0.0007886 -0.2517434 -0.7600358 0.1214197 0.0088522 0.0236952 -0.2217193 -0.0069555 0.0039866 -0.0062122 0.0257506 2.0227187 -0.0145813 -0.0099282 0.3758572 0.8584148 0.0225882 0.0071451 0.0238153 0.1981668 0.1878124 -0.1017303 -0.004276 0.1352877 0.0963144 0.0027688 0.0037238 0.0050611 -0.0793995 0.2692585 0.0272819 -0.002376 -0.0259734 0.2243698 0.005723 -0.0061883 0.0057536 -0.0500871 -1.2537801 -0.3472551 -0.0072543 -0.1795172 -0.0380845 0.0100942 0.0014327 0.0108392 -0.211975 -0.1619456 0.1895733 0.0047465 0.3601371 -0.1200655 -0.0028305 0.0101619 -0.0022885 -0.1096372 0.8390721 0.1937769 0.0002101 0.0114537 0.1436121 0.010879 -0.0062822 0.0098842 -0.1162021 0.3509408 0.0025318 -0.0033766 -0.1696604 0.2157777 0.0076029 -0.007141 0.0060207 -0.059856 -0.3996932 -0.1738665 -0.0038689 -0.0518305 0.0269933 0.0000637 0.0014963 0.000715 0.0419943 0.1636737 0.0550231 0.001003 0.0034663 0.0158977 -0.0027091 -0.0013922 -0.0036411 0.1455163 -0.0156089 -0.0964145 -0.0008314 -0.1416655 0.0213798 -0.001075 -0.0016104 -0.0021711 0.1242539 0.0896762 0.0447394 0.0026394 0.0135087 -0.0936913 -0.0116308 0.0013525 -0.01142 0.1668846 -0.0370447 -0.0900892 -0.0005791 -0.1154757 0.0055676 -0.0026593 -0.0013243 -0.0028075 0.1598325 0.0911478 -0.016861 -0.0001522 0.0185612 -0.0510157 -0.0089586 0.0006071 -0.0083467 0.1474579 -0.1189073 0.027071 0.0026833 0.0499132 0.0849177 -0.0016056 0.0023084 -0.0009922 0.1370096 0.0151449 0.0109101 -0.1016944 -0.0700157 0.067707 0.0565264 -0.1503218 0.0272655 -0.0172139 0.0548643 0.1041823 0.0051062 -0.0100445 -0.1233026 -0.0104489 -0.0000208 -0.0112388 0.111546 0.0200306 0.0017324 0.1014272 -0.0836183 0.0744188 -0.0468757 0.1428259 -0.019096 -0.0285179 unknown
polarizability: 180.4606716|2.0998883|103.5299408|-0.8377471|1.5791793|47.6856343 unknown
InChI: InChI=1S/C9H9NO/c1-2-4-9(11)8-5-3-6-10-7-8/h2-7H,1H3
charge 0 multiplicity 1
20 atoms
O  1.107557 -1.873342 -0.178887
N  -2.317141 1.577129 -0.054619
C  -0.59181 -0.175562 -0.107917
C  0.847953 -0.62613 -0.1315
C  -1.605698 -1.172027 -0.123745
C  -1.009333 1.183081 -0.073632
C  1.932411 0.392143 -0.098494
C  -2.958388 -0.785519 -0.10409
C  3.246331 0.022701 -0.126111
C  -3.267797 0.596266 -0.069431
C  4.418834 0.96248 -0.095979
H  -1.297324 -2.22226 -0.151594
H  -0.28637 2.005249 -0.061941
H  1.667087 1.453889 -0.050328
H  -3.761554 -1.528762 -0.115278
H  3.458442 -1.056416 -0.174313
H  -4.307945 0.941412 -0.053204
H  5.068796 0.745457 0.774564
H  4.108729 2.020033 -0.046296
H  5.051923 0.823678 -0.994501
