program: Gaussian 09
title: 000180758
version: EM64L-G09RevD.01
frameworkgroup: C1[X(C13H17N5O6)]
method: RPBEPBE
basis: SDD
operation: Freq
keyword: #p
keyword: freq=noraman
keyword: PBEPBE/SDD
title: #p freq=noraman PBEPBE/SDD
converged: YES YES NO NO
title: Mulliken charges:
elementType: O O O O O O N N N N N C C C C C C C C C C C C C H H H H H H H H H H H H H H H H H
charge: -0.254712 -0.425763 -0.241337 -0.206953 -0.235697 -0.272662 -0.227138 -0.438829 -0.022652 -0.053764 -0.626506 -0.103106 -0.117669 -0.530579 -0.167171 -0.360053 0.348893 -0.215422 -0.139916 0.016245 0.163890 0.328126 -0.272237 -0.659756 0.275818 0.284482 0.255615 0.257983 0.313045 0.265386 0.256114 0.354697 0.290023 0.320170 0.357875 0.306127 0.236430 0.232327 0.223209 0.235195 0.250269
chargesum: 0.00000
title: Mulliken charges with hydrogens summed into heavy atoms:
elementType: O O O O O O N N N N N C C C C C C C C C C C C C
charge: -0.254712 -0.071066 -0.241337 -0.206953 -0.235697 -0.272662 -0.227138 -0.118659 -0.022652 -0.053764 0.037496 0.172712 0.166814 -0.016981 0.145874 0.161447 0.348893 0.074602 -0.139916 0.016245 0.163890 0.328126 0.196520 0.048917
polarizability: 2.41942671e+02 1.51666363e+01 1.86513081e+02 -2.27964061e+01 2.03183366e+01 1.59648334e+02
1716.lowfreq: -3.0898 0.0007 0.0008 0.0009 2.4687 6.4631 13.7589 20.8279 34.4982
frequency: 13.6863 20.7205 34.4758 43.7530 48.0179 68.7535 71.9656 84.2927 91.1925 101.4958 120.6962 143.8568 172.8815 184.8860 204.9669 208.7076 229.7691 260.7840 268.4330 304.1753 316.0036 325.8646 332.2938 333.6174 373.2078 377.2119 408.4462 436.4074 446.7122 471.1204 499.5241 527.5628 529.1041 543.7814 610.8221 625.5050 636.4634 642.8069 646.7460 682.2676 687.6893 698.1132 714.6619 747.5983 764.3318 788.8139 792.6856 811.8174 815.9497 825.0658 862.6347 876.3808 888.4532 915.4449 933.5183 968.4545 978.6426 984.0065 991.1028 1027.6586 1046.0903 1054.2214 1081.8251 1088.6139 1096.3406 1139.5547 1153.3554 1158.9729 1163.8189 1179.2602 1188.0902 1207.0041 1241.1546 1253.2259 1261.6244 1271.6519 1278.2205 1292.3674 1302.4378 1315.7050 1324.9139 1337.9959 1347.3231 1357.0059 1373.1857 1380.3944 1383.6995 1393.1505 1422.1173 1452.0740 1458.7534 1463.6980 1467.3389 1484.7609 1521.8469 1526.8514 1598.6137 1619.5817 1628.5492 1650.5560 2996.2114 3017.3590 3025.0703 3034.2234 3045.0868 3084.7119 3091.4458 3096.4226 3099.5949 3108.6570 3125.2651 3126.2951 3262.5520 3534.2755 3542.6807 3552.0259 3702.8661
redmass: 5.7066 5.8692 4.5296 4.2061 5.0879 5.5210 3.8708 4.2016 4.5430 4.3102 4.0819 2.6996 3.5676 2.9024 1.9880 4.4686 3.1884 6.8346 1.9270 5.1398 6.3303 4.9824 3.3630 4.8372 4.0676 1.1912 3.7882 1.8432 1.7029 5.8410 2.9094 2.8349 1.5666 4.8061 4.3844 5.7857 6.3179 5.3383 10.8675 3.9774 7.4687 11.8605 7.0176 3.8654 3.7302 1.7514 1.7387 4.4443 2.5066 2.9825 4.0741 3.6980 3.3302 3.0742 4.9654 2.3319 2.8379 2.8355 4.5284 4.4257 3.8028 3.3457 1.6773 2.9204 2.1613 3.8485 2.0942 1.7057 1.6620 2.8129 3.9573 1.3175 1.5704 1.9993 1.3730 1.3258 1.1202 2.0595 1.5478 1.4370 2.2421 1.3230 1.6803 1.2574 1.2836 5.5402 1.2361 1.2303 4.6257 1.1058 1.0873 1.0487 1.0945 1.0530 4.1632 5.9153 1.6202 5.2392 8.5850 4.1526 1.0362 1.0856 1.0621 1.0608 1.0584 1.0885 1.0976 1.1044 1.1021 1.0892 1.1075 1.1065 1.0986 1.0660 1.0734 1.0500 1.1050
irintensity: 0.5876 6.6668 2.6421 3.0413 2.1841 2.7496 2.9529 0.5985 0.4007 2.6581 6.8416 14.3471 5.9369 14.5354 0.7434 20.3339 3.3997 2.8391 2.6082 19.1701 2.0111 9.0684 18.1400 4.7231 20.5421 109.9442 12.0648 101.3209 198.1566 1.9359 5.6957 47.4960 75.2749 0.3157 4.4260 2.2913 11.8460 2.4168 7.5647 9.6439 14.5546 20.6198 6.4510 7.0408 27.4934 21.5247 11.4751 1.5012 10.0047 31.8690 20.3500 13.0434 48.2597 15.0928 17.2280 87.7490 148.5066 95.1124 89.1472 58.5964 29.1304 51.0309 38.9811 61.5039 21.5589 21.0843 59.0497 55.4855 32.3009 304.4658 675.9087 10.3749 11.3357 11.3985 5.7802 19.1014 8.2636 27.6887 55.6569 9.1771 76.5696 12.1855 6.3925 5.3142 14.2964 140.3628 22.5423 25.2112 28.5206 15.9387 15.0116 14.9269 16.4064 17.5237 223.8527 136.4931 11.4557 691.8670 204.2719 298.7311 14.4330 23.1982 7.9715 26.8547 21.2115 3.8041 28.5719 8.8287 3.0403 7.6883 7.5262 28.5325 3.3644 12.4730 26.9646 87.4701 44.3118
temp: 298.150 k
press: 1.00000 atm
elementType: 8 8 8 8 8 8 7 7 7 7 7 6 6 6 6 6 6 6 6 6 6 6 6 6 1 1 1 1 1 1 1 1 1 1 1 1 1 1 1 1 1
symmnumber: 1
zpe: 819003.5 jmol-1
zpe.correction: 0.311942 hartree
zpe.thermalcorrener: 0.335316 hartree
zpe.thermalcorrenthalpy: 0.336261 hartree
zpe.thermalcorrgfe: 0.256002 hartree
zpe.sumelectzpe: -1228.856753 hartree
zpe.sumelectthermal: -1228.833378 hartree
zpe.sumelectthermalent: -1228.832434 hartree
zpe.sumelectthermalfe: -1228.912693 hartree
dipole: 6.0926 9.7437 3.3751
dipole: 11.9770
quadrupole: -148.2074 -153.9396 -137.8699
quadrupole: -53.0965 -10.8234 -1.6257
quadrupole: -1.5351 -7.2673 8.8024 -53.0965 -10.8234 -1.6257
hfenergy: -1229.1686949 hartree
pointgroup: C01 [X(C13H17N5O6)]
dipole: -2.3987752 3.976845 0.7967269 debye
polarizability: 235.9079764|-2.5217949|197.3217239|-35.6765817|-1.2618128|154.8743854 unknown
InChI: InChI=1S/C13H17N5O6/c1-2-22-13(21)23-4-7-6(19)3-8(24-7)18-5-15-9-10(18)16-12(14)17-11(9)20/h5-8,16,19H,2-4,14H2,1H3
charge 0 multiplicity 1
41 atoms
O  -0.334807 0.211922 2.254082
O  -1.531879 2.996393 2.058124
O  -2.91324 0.005452 -0.524671
O  4.82062 -2.52263 -1.599462
O  -5.104411 0.095787 -0.912077
O  -4.361446 -0.996622 1.035196
N  1.620223 -0.192063 0.91285
N  3.189974 1.16219 -0.519617
N  2.449267 -2.267503 0.403278
N  4.757094 -0.179654 -1.793876
N  4.775154 2.153673 -1.979598
C  0.837618 0.845888 1.633399
C  -1.229542 2.023575 1.005191
C  0.293567 1.96173 0.689124
C  -1.545282 0.58436 1.455488
C  -1.759713 -0.422666 0.307876
C  2.668134 -0.012832 0.012945
C  1.549586 -1.597181 1.130145
C  3.169037 -1.287091 -0.308103
C  4.291792 -1.433751 -1.257367
C  4.253683 0.988034 -1.443016
C  -4.162134 -0.365764 -0.028205
C  -6.528343 -0.244468 -0.572447
C  -6.874391 -1.661917 -1.030101
H  1.447011 1.235099 2.469551
H  -1.831839 2.342859 0.142273
H  0.449277 1.68916 -0.369138
H  0.746363 2.9481 0.882865
H  -2.393812 0.54745 2.157328
H  -1.943321 -1.428353 0.721619
H  -0.913295 -0.448888 -0.395519
H  -1.18413 2.654164 2.922943
H  0.825498 -2.021325 1.818566
H  2.887249 2.087345 -0.213771
H  5.547075 2.033999 -2.631378
H  4.354087 3.070972 -1.860412
H  -6.666434 -0.12237 0.516244
H  -7.099345 0.521938 -1.11873
H  -7.951352 -1.84883 -0.863152
H  -6.66599 -1.790559 -2.105835
H  -6.304605 -2.413628 -0.458715
