program: Gaussian 09
title: 000180714
version: EM64L-G09RevD.01
frameworkgroup: C1[X(C10H11BrN2)]
method: RPBEPBE
basis: SDD
operation: Freq
keyword: #p
keyword: freq=noraman
keyword: PBEPBE/SDD
title: #p freq=noraman PBEPBE/SDD
converged: YES YES NO NO
title: Mulliken charges:
elementType: Br N N C C C C C C C C C C H H H H H H H H H H H
charge: -0.013091 -0.412241 -0.572538 0.391400 0.115746 -0.531225 0.249327 -0.429956 -0.392495 -0.396858 -0.307579 -0.218651 -0.187629 0.232100 0.199873 0.270820 0.309311 0.220190 0.200667 0.237656 0.252592 0.243308 0.277781 0.261493
chargesum: 0.00000
title: Mulliken charges with hydrogens summed into heavy atoms:
elementType: Br N N C C C C C C C C C C
charge: -0.013091 -0.102930 -0.033264 0.391400 0.115746 -0.099253 0.249327 -0.159137 0.028362 -0.159201 -0.054988 0.024657 -0.187629
polarizability: 2.12356686e+02 -1.33262546e+01 1.35704573e+02 5.84490229e+00 8.94711419e+00 6.87488552e+01
1716.lowfreq: -13.7634 -4.4788 -0.0006 -0.0005 -0.0003 3.9523 49.2081 55.5212 78.3263
frequency: 49.1267 55.4628 78.3041 118.0193 164.9508 207.6598 210.6908 225.5314 272.2550 296.5559 343.9718 388.8649 422.3547 465.1736 514.0460 568.4007 588.0492 591.0556 605.8614 646.1201 738.5093 751.7988 769.0942 794.4827 804.7600 811.8140 855.2194 876.1542 938.3902 944.0811 1014.0625 1044.8119 1065.5373 1094.1056 1097.3862 1119.8874 1146.2089 1217.5922 1237.4823 1239.0518 1279.5655 1291.2216 1312.1440 1329.8901 1379.0701 1388.9747 1395.7275 1458.5425 1462.4993 1466.2975 1491.5184 1557.5560 1579.9485 1621.3837 1637.0820 2886.3585 2962.2485 3028.0189 3054.8600 3139.1592 3162.3733 3173.5493 3222.0429 3456.9359 3584.5159 3613.6659
redmass: 4.4839 5.0397 1.8425 4.9153 4.7539 2.6202 1.5539 3.7655 5.2529 4.5454 3.4551 5.7495 2.8958 3.6036 1.1728 5.6460 1.5153 3.7351 2.7033 4.2000 4.1866 3.1222 2.7478 1.4891 1.4253 1.7637 1.4727 5.4797 1.7652 1.3673 2.2356 2.0699 3.3161 2.9369 1.6854 1.3582 1.3973 1.4681 1.3476 2.5224 1.4020 1.3947 1.4716 1.7769 1.3981 6.6204 2.8487 4.8319 3.0764 1.0945 1.0864 7.2680 6.6280 6.9592 1.0947 1.0714 1.0666 1.0869 1.0972 1.0892 1.0929 1.0955 1.0985 1.0449 1.0975 1.0810
irintensity: 0.9983 1.4288 4.9128 0.0409 2.3629 18.7124 33.4612 1.2725 6.7264 2.2997 27.1634 0.2521 13.5426 1.8569 116.9972 1.7561 216.8132 12.4475 39.9167 6.8043 9.0973 0.9664 13.2154 8.6130 57.7376 24.3878 23.8516 36.9974 3.4633 0.5546 3.6731 12.5349 20.1718 10.9970 58.5916 3.0080 4.3360 4.2777 16.3041 5.5934 0.3910 4.2564 1.4015 25.3404 17.5009 36.6660 0.2018 25.9379 22.7880 7.6803 5.0548 10.6660 1.0557 29.8281 39.3353 107.0139 37.0786 23.0465 36.7841 8.9983 3.3046 6.6809 0.8386 0.6781 0.3561 63.7490
temp: 298.150 k
press: 1.00000 atm
elementType: 35 7 7 6 6 6 6 6 6 6 6 6 6 1 1 1 1 1 1 1 1 1 1 1
symmnumber: 1
zpe: 498292.7 jmol-1
zpe.correction: 0.189790 hartree
zpe.thermalcorrener: 0.202181 hartree
zpe.thermalcorrenthalpy: 0.203125 hartree
zpe.thermalcorrgfe: 0.149591 hartree
zpe.sumelectzpe: -509.685728 hartree
zpe.sumelectthermal: -509.673337 hartree
zpe.sumelectthermalent: -509.672393 hartree
zpe.sumelectthermalfe: -509.725927 hartree
dipole: -2.3526 1.3511 0.6236
dipole: 2.7838
quadrupole: -93.4690 -66.1397 -89.0946
quadrupole: 5.5970 -2.1284 2.9589
quadrupole: -10.5679 16.7614 -6.1935 5.5970 -2.1284 2.9589
hfenergy: -509.8755181 hartree
pointgroup: C01 [X(C10H11Br1N2)]
dipole: -0.8900975 -0.6135707 -0.1754278 debye
dipolederiv: -0.7573095 -0.1763856 0.0749084 -0.1288697 -0.1178792 0.010559 0.0904625 0.0197954 -0.0656784 -0.5707765 0.2855835 0.0285372 -0.1275657 -0.5838317 -0.0069064 0.0317981 -0.0842381 -0.2791916 -0.9562027 0.0371672 0.1252295 0.0254848 -0.4957522 0.1306044 0.1204704 0.1262767 -0.272754 0.180323 -0.168993 -0.0358511 -0.0760804 -0.1453045 0.0157526 -0.0721873 0.0415712 -0.1384616 0.1986144 0.3403312 0.0143639 -0.0309983 -0.1974069 -0.0100242 -0.0237652 -0.0681841 -0.0018753 0.0848985 0.0617095 -0.0140062 0.0523908 0.0578501 0.0692539 -0.1479612 0.0957016 0.104541 -0.0729394 0.0856164 0.0211578 0.4214609 0.4401674 0.0006745 0.0563635 0.0259963 0.0347235 0.1578426 -0.44111 -0.089237 -0.2576974 0.1741715 0.064194 -0.0780346 0.1064247 -0.1611093 0.6819496 -0.0712475 -0.0613887 -0.1961036 0.36248 -0.0051989 0.0500909 -0.0405743 0.1673436 0.1273831 -0.0117865 -0.0353097 0.1388375 0.1187216 0.0014237 -0.0238749 0.0277915 -0.142968 -0.2474266 -0.1461518 -0.0031021 -0.0021135 -0.0732188 0.0076835 0.0196084 0.0274658 -0.1329885 -0.4975677 -0.0324757 0.0454784 -0.0970717 -0.0076071 0.0267992 0.038533 0.0177305 -0.1405486 1.2237181 0.2554635 -0.1634363 0.1196686 0.1348794 0.0142159 -0.1893193 -0.0094239 -0.114188 -0.0543624 -0.0688777 0.0590905 -0.1037796 -0.0304776 0.0638416 0.0283358 0.0374843 0.0541747 0.0293242 -0.0064187 -0.0262544 0.0737375 -0.0441507 -0.142483 0.0176025 -0.0947573 -0.0696761 0.0305281 -0.0699165 0.0219509 -0.0684852 0.0274543 -0.0087411 0.0206326 -0.0074705 0.1952518 0.1371382 0.0076851 0.0285149 0.0064559 0.2352255 -0.0141471 0.032264 -0.0080799 0.339757 0.0241215 0.0059458 -0.0317059 -0.0263661 -0.0192259 -0.1268436 0.0053104 -0.0958512 -0.0745461 -0.2460895 -0.0683609 0.1025485 -0.1317558 -0.058241 0.077381 0.0800027 0.0337292 0.0015788 -0.0168381 0.0971997 0.03522 0.085047 -0.0116095 -0.0222853 0.0393722 -0.0273151 0.1393143 0.0306298 0.0585195 0.0267037 0.0808271 0.0059116 -0.0299078 0.0309328 -0.0272131 0.1727483 0.0718754 -0.0628443 0.005739 -0.0574863 -0.0467405 -0.0163731 0.0079965 -0.0145157 0.1655511 0.2296309 0.0987806 -0.0297288 0.2398299 0.1655955 0.0658219 -0.0945408 0.0433702 0.0607192 0.2115351 -0.0094339 -0.0994226 0.060633 0.1089888 -0.1652947 -0.040093 -0.1257141 0.1582824 unknown
polarizability: 209.3738769|18.389697|138.90654|-12.1990483|3.0283524|68.5296974 unknown
InChI: InChI=1S/C10H11BrN2/c11-8-1-2-9-7(3-4-12)6-13-10(9)5-8/h1-2,5-6,13H,3-4,12H2
charge 0 multiplicity 1
24 atoms
Br 4.616477 0.924885 -0.372166
N  0.200883 -2.274651 -0.062914
N  -4.47816 1.488469 -0.343542
C  -1.351695 -0.63401 0.335898
C  -0.039339 -0.019494 0.202597
C  -2.663824 0.068189 0.582275
C  0.912382 -1.072793 -0.046018
C  -1.159591 -2.005212 0.168819
C  -3.183343 0.851717 -0.653511
C  0.431123 1.318014 0.278862
C  2.29372 -0.829877 -0.221056
C  1.804006 1.584129 0.110157
C  2.7041 0.510838 -0.137055
H  -3.448227 -0.653548 0.873192
H  -2.558748 0.778628 1.429302
H  -1.891567 -2.810453 0.202449
H  0.602364 -3.198196 -0.206925
H  -3.338191 0.138288 -1.483924
H  -2.390968 1.564075 -0.98797
H  -0.260478 2.145614 0.470441
H  3.009952 -1.634252 -0.41062
H  2.184172 2.607719 0.166971
H  -4.992337 1.831123 -1.160213
H  -4.43101 2.191197 0.40145
