program: Gaussian 09
title: 000016418
version: EM64L-G09RevD.01
frameworkgroup: C1[X(C5H8O)]
method: RPBEPBE
basis: SDD
operation: Freq
keyword: #p
keyword: freq=noraman
keyword: PBEPBE/SDD
title: #p freq=noraman PBEPBE/SDD
converged: YES YES NO NO
title: Mulliken charges:
elementType: O C C C C C H H H H H H H H
charge: -0.194097 -0.448422 -0.436076 -0.029614 -0.054793 -0.589023 0.226674 0.224782 0.247254 0.231463 0.210958 0.172724 0.216893 0.221276
chargesum: 0.00000
title: Mulliken charges with hydrogens summed into heavy atoms:
elementType: O C C C C C
charge: -0.194097 0.003035 0.042641 0.181344 0.117932 -0.150855
polarizability: 7.46908348e+01 7.92455020e-01 4.99012016e+01 6.03145414e+00 2.78017232e+00 4.16249830e+01
1716.lowfreq: -30.5390 -4.1667 -0.0007 0.0001 0.0004 7.9999 55.4401 81.5383 158.9028
frequency: 55.2940 81.5298 158.8834 176.2890 299.3942 411.2806 624.4417 662.8689 665.9232 839.3650 895.9217 939.9457 945.6768 991.0188 1009.7120 1071.5312 1124.2896 1194.1895 1252.4772 1269.0210 1291.4493 1339.8569 1375.0414 1422.8678 1427.4928 1462.0162 1644.5564 1659.5405 2855.3821 2955.5193 2987.3731 2999.0137 3055.3292 3074.7215 3092.6276 3196.7788
redmass: 2.9501 2.6260 2.1641 2.6198 2.7296 2.0927 1.4922 1.2905 3.6465 1.3097 2.5735 1.6522 1.3529 1.2747 1.4379 2.6375 1.7268 1.5800 1.3224 1.1778 1.2446 1.6196 1.2106 1.0907 1.1847 1.0978 7.5972 4.7748 1.0842 1.0627 1.0676 1.0904 1.0943 1.0828 1.0740 1.1146
irintensity: 2.8966 1.6838 4.0482 5.8803 2.2371 4.1459 20.0208 7.9163 5.3143 3.5538 10.7243 9.9034 73.7570 9.3135 10.9731 3.2767 3.1768 5.4576 18.7439 2.9866 1.6665 11.8153 5.8304 34.4708 6.4555 18.3185 130.4836 17.3872 154.2602 32.7578 11.7849 13.2007 4.4122 44.4613 5.3281 29.2365
temp: 298.150 k
press: 1.00000 atm
elementType: 8 6 6 6 6 6 1 1 1 1 1 1 1 1
symmnumber: 1
zpe: 302108.6 jmol-1
zpe.correction: 0.115067 hartree
zpe.thermalcorrener: 0.122279 hartree
zpe.thermalcorrenthalpy: 0.123223 hartree
zpe.thermalcorrgfe: 0.083265 hartree
zpe.sumelectzpe: -270.037455 hartree
zpe.sumelectthermal: -270.030244 hartree
zpe.sumelectthermalent: -270.029300 hartree
zpe.sumelectthermalfe: -270.069257 hartree
dipole: -1.2047 2.5754 -0.3455
dipole: 2.8642
quadrupole: -41.8295 -37.3058 -35.7504
quadrupole: 5.6177 -0.7369 1.6545
quadrupole: -3.5343 0.9894 2.5449 5.6177 -0.7369 1.6545
hfenergy: -270.1525224 hartree
pointgroup: C01 [X(C5H8O1)]
dipole: 0.4870583 -1.0089469 -0.1207965 debye
dipolederiv: -0.6565221 0.1248554 0.0154538 0.2811396 -0.7029754 -0.0806916 0.0217058 -0.0807292 -0.3083497 -0.0962601 0.015516 -0.0062003 0.0104582 0.0588127 0.0331268 0.0395872 0.0179647 0.1254392 -0.4676432 0.1503582 0.0020744 0.3289167 -0.0491817 -0.0568019 -0.0107145 -0.0350319 0.1670441 0.3260849 -0.0527148 -0.0642277 -0.1846385 -0.0591953 -0.1707775 -0.0406367 -0.1874217 0.0053095 1.0754673 -0.159918 0.0240202 -0.2257538 0.8654838 0.1752022 0.0416277 0.1637699 0.1014597 -0.1909288 -0.1261493 0.0260889 -0.1248317 -0.1787668 -0.2300779 0.0695525 -0.2250443 -0.1809648 0.0313953 0.0302858 0.070007 0.0185284 0.0527133 -0.0772184 0.0235843 -0.0873841 -0.0570541 0.0434774 -0.0141831 0.0035388 -0.001804 -0.0248755 0.0938979 -0.0337767 0.1159918 -0.0303871 0.0606596 0.0153179 0.011982 -0.0630949 0.0636986 -0.0799522 -0.0033652 -0.1082935 -0.0548886 0.0698664 0.0095681 -0.0078001 -0.0521855 -0.0163068 0.0938427 -0.0138882 0.1344243 0.0131261 0.0324553 0.0181721 0.0039596 0.0712057 0.0051308 0.1496598 -0.0236136 0.1488075 -0.0100952 -0.1948077 -0.1417286 -0.0423588 -0.1845246 -0.1762175 -0.070239 -0.0640947 -0.071529 0.0749138 -0.1107829 0.0736693 -0.0081164 0.0947375 0.1189807 0.0668236 -0.0031547 0.0705615 0.1272966 0.0775384 0.056951 -0.0284215 0.0318471 0.042699 0.1532055 -0.0028133 0.143914 0.0271507 unknown
polarizability: 74.350303|0.9464589|49.7727341|-6.8026559|-3.1162245|42.0939823 unknown
InChI: InChI=1S/C5H8O/c1-2-3-4-5-6/h2,5H,1,3-4H2
charge 0 multiplicity 1
14 atoms
O  -2.484548 0.75343 0.11877
C  0.386388 0.344964 0.226272
C  -0.594637 -0.812564 -0.069758
C  1.813181 -0.142455 0.361743
C  -2.056972 -0.405064 -0.100369
C  2.858857 0.273766 -0.396116
H  0.061338 0.844829 1.160589
H  0.312005 1.105861 -0.571326
H  -0.355689 -1.297845 -1.040029
H  -0.494599 -1.624448 0.684163
H  1.992088 -0.892483 1.14966
H  -2.768968 -1.238609 -0.340109
H  3.871713 -0.11561 -0.243165
H  2.730543 1.020328 -1.189925
