program: Gaussian 09
title: 000180745
version: EM64L-G09RevD.01
frameworkgroup: C1[X(C20H23NO4)]
method: RPBEPBE
basis: SDD
operation: Freq
keyword: #p
keyword: freq=noraman
keyword: PBEPBE/SDD
title: #p freq=noraman PBEPBE/SDD
converged: YES YES NO NO
title: Mulliken charges:
elementType: O O O O N C C C C C C C C C C C C C C C C C C C C H H H H H H H H H H H H H H H H H H H H H H H
charge: -0.286381 -0.462760 -0.334303 -0.264532 -0.081324 -0.099708 -0.434081 0.256051 0.580199 -0.302036 -0.362765 0.428082 -0.460774 -0.000447 -0.595804 -0.421678 0.133396 0.079725 -0.486615 0.200539 -0.366936 -0.627943 -0.618010 -0.527104 -0.519045 0.258248 0.240033 0.328055 0.190355 0.243530 0.241867 0.259699 0.238534 0.238471 0.246035 0.185201 0.219707 0.235940 0.236418 0.217711 0.187532 0.393222 0.274227 0.206416 0.224493 0.229522 0.247815 0.231223
chargesum: 0.00000
title: Mulliken charges with hydrogens summed into heavy atoms:
elementType: O O O O N C C C C C C C C C C C C C C C C C C C C
charge: -0.286381 -0.069538 -0.334303 -0.264532 -0.081324 -0.099708 0.064200 0.256051 0.580199 0.026019 0.071120 0.428082 -0.218907 -0.000447 -0.336105 -0.183144 0.133396 0.079725 -0.248144 0.200539 -0.120901 0.012906 0.023650 0.178032 0.189515
polarizability: 3.68867289e+02 3.41320866e+01 2.08053830e+02 -1.25426708e+01 2.11460634e+01 2.26635181e+02
1716.lowfreq: -6.2351 -0.0007 -0.0007 -0.0003 3.1968 8.2728 21.2200 31.4614 42.5063
frequency: 20.8575 31.4590 42.4880 46.9230 52.9241 75.6762 85.0872 100.5397 120.7011 139.1207 141.3582 160.1210 168.7610 189.2403 199.6078 212.0740 219.8417 236.5826 242.2716 253.3857 291.8874 291.9698 305.3246 317.1532 328.3572 339.3164 344.5315 366.3281 393.9782 416.8777 422.8844 436.0721 450.2986 465.1244 506.1472 519.9900 528.8804 556.5384 585.3498 591.5799 607.8999 639.4690 673.2129 684.8623 687.8344 713.7249 740.0144 758.3071 776.6374 785.5099 794.7151 814.0231 827.7388 831.0139 872.6410 900.3554 919.3707 922.6943 933.0099 965.7709 973.7082 996.0256 1023.6595 1027.5757 1036.0446 1064.1571 1071.9544 1091.5719 1109.4678 1117.0155 1118.6945 1125.6841 1140.7084 1148.4452 1156.7707 1170.3260 1177.5974 1183.7547 1197.3018 1219.8043 1233.1033 1242.1934 1251.7381 1260.9559 1264.8461 1267.3388 1300.2994 1310.2099 1348.4005 1365.0327 1379.1129 1384.9761 1413.8454 1418.5147 1422.9486 1436.0925 1440.0721 1455.1341 1455.7817 1461.7614 1464.9399 1466.8080 1470.3628 1475.8796 1476.1055 1478.3940 1483.0692 1486.0867 1486.1975 1526.5116 1568.5298 1579.4199 1616.0149 1616.3075 1636.1148 2841.1535 2851.0453 2866.7390 2972.6882 2974.1237 2998.6434 3020.0453 3026.0217 3040.4538 3065.6507 3072.8583 3080.1346 3084.0215 3086.3029 3117.3541 3126.1725 3129.5798 3133.1342 3137.3458 3143.2687 3167.7530 3182.9967 3470.1318
redmass: 2.6148 4.5742 3.7884 4.4267 4.7245 3.2820 3.5771 2.1522 3.7944 3.6706 2.6696 2.2154 2.9602 2.3171 3.4789 3.1870 1.3145 1.2884 1.2555 2.4208 3.7878 4.4553 4.7838 7.0957 5.2201 3.7783 2.5054 5.4736 5.4817 3.1232 3.2716 3.1637 3.3443 4.7340 4.3961 5.9459 1.1087 6.0840 4.6267 4.4817 4.3094 5.1808 4.6476 5.6897 4.3425 4.6172 3.1881 3.9366 2.4917 2.0250 1.8955 4.3255 2.3069 2.1407 2.8262 1.6791 1.4020 2.1187 3.9927 4.8190 1.3622 4.2958 2.1799 1.9181 1.7164 4.0595 2.6516 1.4209 1.3204 1.2541 1.6403 2.0576 1.6564 1.6166 1.6535 1.9726 1.4479 2.8006 1.6501 1.7982 1.7587 2.0561 1.6976 2.5618 2.1632 1.9612 1.3895 1.2605 2.5025 2.2288 1.4111 5.0042 2.0287 1.1449 1.2079 1.3386 1.1668 1.0709 1.1111 1.0509 1.4958 1.1926 1.0915 1.0724 1.5801 1.0887 2.3187 1.0638 1.0591 7.8449 7.2776 7.7981 7.0111 6.8964 7.7084 1.0577 1.0637 1.0630 1.0321 1.0353 1.0588 1.0727 1.0712 1.0865 1.1048 1.1040 1.1010 1.1007 1.0961 1.0857 1.0912 1.1054 1.1002 1.0897 1.0981 1.0955 1.0901 1.0641
irintensity: 0.4163 0.0868 1.7229 0.7709 3.2346 3.2523 5.6581 3.5511 0.1462 1.6865 2.5155 2.2779 0.7180 3.7556 1.6443 1.6906 0.2753 1.1341 2.0911 2.4900 3.3793 2.6782 12.0455 5.5802 0.5628 1.1083 6.6040 2.9414 1.3308 2.5513 1.1380 1.5995 1.9745 12.1390 0.1767 3.2364 118.8566 6.2319 0.7113 4.2717 4.8163 22.9494 0.6107 8.1495 1.3375 10.2512 7.2768 2.0773 8.2955 19.4907 9.9844 18.4142 47.5820 16.9189 22.2795 43.6012 5.7528 40.4029 39.2253 42.2375 5.2479 27.4475 24.2159 24.8558 13.2048 130.9704 13.3683 3.4480 52.6879 0.2431 32.5117 146.2388 4.5458 1.3549 7.9741 109.9707 8.0541 4.3332 52.2854 7.6302 42.7836 26.3048 22.3707 254.9072 70.9390 24.0196 12.1036 3.1841 3.3809 7.5833 5.2810 39.9608 10.9770 6.3954 41.5400 25.8785 1.4016 30.4797 6.4078 18.3111 101.5110 35.8036 28.7645 17.8738 6.8935 6.1136 1.0064 36.4582 35.2891 279.7597 47.4662 182.1178 38.3912 5.7421 22.8910 76.8653 80.6576 172.8654 89.7605 101.4695 10.1878 39.0696 51.4878 5.4137 37.6545 8.3870 22.0529 48.9907 40.7129 0.6662 4.6530 11.2198 20.8301 1.2363 30.2879 19.0582 16.9770 103.0110
temp: 298.150 k
press: 1.00000 atm
elementType: 8 8 8 8 7 6 6 6 6 6 6 6 6 6 6 6 6 6 6 6 6 6 6 6 6 1 1 1 1 1 1 1 1 1 1 1 1 1 1 1 1 1 1 1 1 1 1 1
symmnumber: 1
zpe: 1015195.3 jmol-1
zpe.correction: 0.386667 hartree
zpe.thermalcorrener: 0.411481 hartree
zpe.thermalcorrenthalpy: 0.412425 hartree
zpe.thermalcorrgfe: 0.331782 hartree
zpe.sumelectzpe: -1129.647168 hartree
zpe.sumelectthermal: -1129.622354 hartree
zpe.sumelectthermalent: -1129.621410 hartree
zpe.sumelectthermalfe: -1129.702053 hartree
dipole: 8.2064 2.1475 0.5347
dipole: 8.4996
quadrupole: -126.9579 -142.9285 -142.2847
quadrupole: -8.9102 -2.8669 6.9562
quadrupole: 10.4325 -5.5381 -4.8944 -8.9102 -2.8669 6.9562
hfenergy: -1130.0338353 hartree
pointgroup: C01[X(C20H23N1O4)]
dipole: -3.1032699 -1.2427327 -0.087432 debye
polarizability: 357.6670775|48.4518659|226.5257046|27.2933094|-18.8005848|219.3635186 unknown
InChI: InChI=1S/C20H23NO4/c1-21(2)10-9-20-12-17(25-4)15(22)11-14(20)7-5-13-6-8-16(24-3)19(23)18(13)20/h5-8,11-12,23H,9-10H2,1-4H3
charge 0 multiplicity 1
48 atoms
O  2.197787 3.161501 -0.829586
O  -1.727466 0.998778 -1.763792
O  -4.274983 0.54098 -1.651689
O  3.750725 2.273041 1.490727
N  2.593767 -2.16836 -1.860981
C  0.249477 0.122029 0.344705
C  0.726538 -1.123998 -0.573291
C  -1.286457 -0.077714 0.410197
C  0.917338 -0.044745 1.71141
C  0.694966 1.396722 -0.343203
C  2.25093 -1.32072 -0.693015
C  -1.843505 -0.864335 1.479324
C  0.335959 -0.983347 2.657026
C  -2.168007 0.323656 -0.616536
C  2.06471 0.652772 2.030101
C  -0.978535 -1.365627 2.543995
C  1.804157 2.114207 0.017909
C  2.631975 1.719453 1.199641
C  -3.229127 -1.164836 1.520554
C  -3.566124 0.029915 -0.545579
C  -4.108203 -0.709317 0.517989
C  2.168982 -3.573795 -1.703362
C  4.023616 -2.06266 -2.219162
C  2.675805 4.418913 -0.21016
C  -5.723246 0.328421 -1.699294
H  0.315889 -0.95186 -1.584821
H  0.244484 -2.025217 -0.150348
H  0.147316 1.700618 -1.237816
H  2.659518 -1.745728 0.258875
H  2.73335 -0.338223 -0.844047
H  0.938019 -1.297895 3.517426
H  2.600578 0.44493 2.964989
H  -1.43039 -2.023148 3.296578
H  -3.61777 -1.761798 2.352769
H  -5.176053 -0.939531 0.567364
H  2.650792 -4.081819 -0.82756
H  2.430193 -4.141837 -2.614202
H  1.074848 -3.633427 -1.57369
H  4.281501 -1.005459 -2.405625
H  4.216631 -2.631521 -3.146776
H  4.711852 -2.452141 -1.426035
H  -2.522715 1.176276 -2.337148
H  3.574087 4.235443 0.39957
H  1.877285 4.869365 0.411054
H  2.900511 5.078711 -1.062241
H  -5.960708 -0.75142 -1.736828
H  -6.060397 0.817857 -2.624256
H  -6.216498 0.793789 -0.825358
