program: Gaussian 09
title: 000180700
version: EM64L-G09RevD.01
frameworkgroup: C1[X(C19H17NO3)]
method: RPBEPBE
basis: SDD
operation: Freq
keyword: #p
keyword: freq=noraman
keyword: PBEPBE/SDD
title: #p freq=noraman PBEPBE/SDD
converged: YES YES NO NO
title: Mulliken charges:
elementType: O O O N C C C C C C C C C C C C C C C C C C C H H H H H H H H H H H H H H H H H
charge: -0.298445 -0.267752 -0.438830 -0.154366 -0.043419 0.008003 0.500425 0.225949 -0.589287 -0.410098 0.015819 0.181770 0.425716 -0.055689 -0.658494 0.192973 -0.643392 -0.847850 -0.374922 -0.595840 -0.195379 0.287943 -0.451763 0.225941 0.236904 0.217234 0.220589 0.260766 0.259388 0.229060 0.221311 0.255831 0.238766 0.219697 0.293569 0.271215 0.233579 0.232622 0.218185 0.352270
chargesum: 0.00000
title: Mulliken charges with hydrogens summed into heavy atoms:
elementType: O O O N C C C C C C C C C C C C C C C C C C C
charge: -0.298445 -0.267752 -0.086560 -0.154366 -0.043419 0.008003 0.500425 0.225949 -0.126442 0.027725 0.015819 0.181770 0.425716 -0.055689 -0.397729 0.192973 0.066368 -0.133555 -0.081353 -0.324625 0.270822 0.287943 -0.233578
polarizability: 3.37561638e+02 1.90726326e+01 2.95896938e+02 7.03408956e-01 -5.84084721e+00 1.10864817e+02
1716.lowfreq: -77.5758 -0.0007 -0.0003 -0.0001 4.6020 8.0568 11.2678 51.9879 71.6590
frequency: -77.5679 51.9632 71.6573 90.4787 115.2808 137.7730 160.5213 171.9364 180.9543 196.8346 230.3904 238.4163 270.3862 279.9746 297.5810 327.0633 331.6060 340.1470 350.5393 359.7927 378.0852 383.4988 405.3253 427.0906 460.1084 468.6045 502.3988 527.9741 557.1389 583.0839 588.9964 616.1701 620.7876 659.3093 685.5836 690.4465 717.4297 730.7503 750.5507 775.0787 776.1253 800.4170 842.3512 854.5347 859.4777 864.8886 871.9027 918.4889 946.6511 955.8088 962.6284 996.6141 1024.9010 1030.8787 1033.5106 1062.8156 1066.4321 1068.0174 1094.9259 1105.0298 1120.4403 1124.8986 1157.5875 1162.7426 1180.8493 1188.5625 1211.0421 1214.2767 1239.1269 1268.5444 1282.3627 1313.4836 1327.1051 1339.6161 1350.7967 1371.1193 1390.1622 1393.2767 1399.4945 1401.9956 1416.6441 1439.8785 1453.2850 1456.8951 1462.3478 1465.5256 1476.3968 1482.4173 1487.1511 1490.2050 1501.9334 1509.5263 1541.0543 1582.3488 1598.8022 1622.3786 1633.4988 2901.8261 2949.6181 2960.5528 2971.8270 3001.8795 3003.9462 3017.3085 3033.4200 3053.2158 3079.0761 3096.6338 3115.1166 3117.6494 3168.4413 3179.0626 3186.3208 3585.4323
redmass: 2.3322 4.1121 6.5444 3.5609 4.1617 4.1046 2.6396 1.5542 3.9770 3.1884 3.2829 2.9829 2.2169 2.4572 5.5428 3.5359 3.1228 1.1511 4.9234 3.8706 4.2427 3.4360 4.8645 3.7209 3.2957 4.4664 4.3157 3.7569 5.0189 5.7690 4.8793 5.7160 3.7850 4.5268 7.6001 8.1650 6.1910 5.0725 3.8603 3.0844 2.8493 2.6888 3.5626 1.8202 5.7292 2.3272 1.6958 5.9060 1.3384 2.6203 2.8147 5.4253 3.0371 2.4953 1.4822 2.3816 1.8677 1.4641 1.6304 1.7680 1.0371 2.1165 1.4101 1.5872 1.3732 1.6924 1.8355 2.6160 2.1055 2.2574 1.9355 2.1459 2.1650 2.4656 2.0828 1.5109 2.9570 1.7042 2.5257 4.1006 2.6876 1.7795 2.0716 1.1332 1.5149 2.4023 1.0751 1.5544 1.1313 1.1533 1.4079 1.2690 4.3658 7.1596 7.7431 9.7295 6.3069 1.0695 1.0397 1.0424 1.0656 1.0901 1.0540 1.0997 1.0941 1.0958 1.1188 1.0954 1.0953 1.0906 1.0932 1.0904 1.0933 1.0660
irintensity: 12.7592 0.7205 0.0891 2.8963 0.5196 4.7410 1.7844 0.9266 2.3967 5.2170 4.8897 4.5599 6.1935 3.2094 0.5282 16.3075 5.5491 130.5258 0.6978 0.6237 5.2587 0.5432 1.9248 3.5372 4.8223 1.1848 1.3066 1.1930 1.1952 21.2219 6.3929 5.5763 13.4629 1.9319 0.3999 1.6323 0.5947 1.2963 2.1807 15.2281 19.1353 20.5220 9.9124 32.9368 12.9839 38.9533 30.7746 47.8998 2.3544 44.6476 32.3218 160.3022 9.5011 8.3073 3.0193 8.7178 3.3992 5.4028 14.7211 52.4088 0.0135 73.2345 250.8582 2.7364 29.1404 15.7405 21.0659 54.3173 4.2835 33.7170 1.6489 91.7815 176.6754 80.5290 24.6194 6.0164 108.9311 3.0780 26.9481 15.3272 28.4596 17.0066 7.3057 6.9051 24.6974 21.5720 2.0687 63.7138 2.2560 22.7523 62.2731 41.4231 78.0580 121.2267 77.6315 117.7861 116.1422 103.9705 118.4304 67.3976 19.3555 124.1096 118.1613 30.8888 25.7945 33.7601 35.9546 16.7258 10.5821 19.4949 3.7348 4.8607 5.4601 53.5651
temp: 298.150 k
press: 1.00000 atm
elementType: 8 8 8 7 6 6 6 6 6 6 6 6 6 6 6 6 6 6 6 6 6 6 6 1 1 1 1 1 1 1 1 1 1 1 1 1 1 1 1 1
symmnumber: 1
zpe: 827500.0 jmol-1
zpe.correction: 0.315178 hartree
zpe.thermalcorrener: 0.333376 hartree
zpe.thermalcorrenthalpy: 0.334320 hartree
zpe.thermalcorrgfe: 0.270583 hartree
zpe.sumelectzpe: -1013.010703 hartree
zpe.sumelectthermal: -1012.992505 hartree
zpe.sumelectthermalent: -1012.991561 hartree
zpe.sumelectthermalfe: -1013.055298 hartree
dipole: 1.6867 0.6764 0.8320
dipole: 1.9987
quadrupole: -130.8092 -104.0770 -136.7972
quadrupole: 10.2460 -1.5620 0.5390
quadrupole: -6.9147 19.8174 -12.9027 10.2460 -1.5620 0.5390
hfenergy: -1013.3258808 hartree
pointgroup: C01 [X(C19H17N1O3)]
dipole: -0.6581863 0.2823569 -0.3246748 debye
polarizability: 337.0709639|-19.662006|295.9680816|1.7515359|10.3234027|111.2843473 unknown
InChI: InChI=1S/C19H17NO3/c1-10-14-8-12(21)3-4-13(14)17-16-11(5-6-20(2)18(10)16)7-15-19(17)23-9-22-15/h3-4,7-8,21H,5-6,9H2,1-2H3
charge 0 multiplicity 1
40 atoms
O  -1.035183 -3.097181 -0.265405
O  -3.395878 -2.747385 -0.045314
O  5.29657 -1.121554 0.08714
N  -0.663564 3.131336 -0.105976
C  -0.970169 0.678214 0.07618
C  -0.088308 1.854766 0.094209
C  -2.38037 0.846817 0.266023
C  -0.383117 -0.639615 -0.062508
C  -2.874703 2.235966 0.615429
C  -2.130263 3.282821 -0.217999
C  1.294215 1.688939 0.310937
C  1.06442 -0.795138 -0.096634
C  1.884925 0.36912 0.160585
C  -1.315863 -1.7046 -0.113743
C  -3.263886 -0.251493 0.233606
C  -2.695903 -1.514254 0.018468
C  0.057921 4.168942 -0.871689
C  2.18585 2.83756 0.760131
C  1.697417 -2.055049 -0.310421
C  3.303079 0.201023 0.224881
C  -2.352904 -3.783706 -0.235594
C  3.890363 -1.052703 0.017194
C  3.090994 -2.195788 -0.261204
H  -3.961359 2.329998 0.441986
H  -2.695395 2.435794 1.691659
H  -2.437201 3.1925 -1.286569
H  -2.399381 4.304401 0.115263
H  -4.339132 -0.129801 0.387309
H  1.003427 3.770775 -1.267178
H  0.27659 5.069546 -0.265665
H  -0.5622 4.483113 -1.736723
H  1.58646 3.687703 1.121222
H  2.818592 2.503739 1.603948
H  2.87413 3.212223 -0.024315
H  1.080184 -2.933247 -0.507225
H  3.964119 1.049898 0.4112
H  -2.375055 -4.48134 0.619969
H  -2.515514 -4.288838 -1.20417
H  3.556014 -3.175684 -0.429568
H  5.606279 -2.046219 -0.077443
