program: Gaussian 09
title: 000180749
version: EM64L-G09RevD.01
frameworkgroup: C1[X(C20H23NO5)]
method: RPBEPBE
basis: SDD
operation: Freq
keyword: #p
keyword: freq=noraman
keyword: PBEPBE/SDD
title: #p freq=noraman PBEPBE/SDD
converged: YES YES NO NO
title: Mulliken charges:
elementType: O O O O O N C C C C C C C C C C C C C C C C C C C C H H H H H H H H H H H H H H H H H H H H H H H
charge: -0.439098 -0.318394 -0.299075 -0.284514 -0.447731 -0.001154 -0.174729 0.060867 -0.392505 -0.687823 -0.567462 0.458586 0.147171 0.480109 -0.590758 0.145108 -0.644996 -0.002931 0.226445 -0.668014 -0.494709 0.189164 0.177177 -0.523522 -0.527118 -0.524459 0.233809 0.219343 0.243971 0.295545 0.218899 0.217615 0.281023 0.202987 0.262908 0.251621 0.261729 0.226379 0.316938 0.231190 0.229850 0.250580 0.360024 0.216949 0.227007 0.257983 0.260990 0.208399 0.228626
chargesum: 0.00000
title: Mulliken charges with hydrogens summed into heavy atoms:
elementType: O O O O O N C C C C C C C C C C C C C C C C C C C C
charge: -0.439098 -0.318394 -0.299075 -0.284514 -0.087707 -0.001154 0.059081 0.060867 0.070809 -0.173379 -0.068824 0.458586 0.147171 0.480109 0.126757 0.145108 -0.383267 -0.002931 0.226445 -0.441635 -0.177771 0.189164 0.177177 0.188098 0.174822 0.173555
polarizability: 3.38437419e+02 9.29002918e+00 2.89699626e+02 -2.03457901e+00 -8.66016585e+00 1.50660368e+02
1716.lowfreq: -5.5929 -0.0004 0.0004 0.0005 3.1372 4.3910 36.2115 46.2390 50.3273
frequency: 36.1443 46.2327 50.2887 68.1949 68.5083 83.0083 94.2664 111.7378 131.0705 140.3549 158.4331 167.8988 176.1475 183.4011 195.5549 212.3774 224.1533 237.4215 250.0286 268.5487 275.7973 286.2997 296.4502 309.6103 316.0444 333.3337 339.5575 352.0136 380.5879 395.9324 427.3791 430.1736 439.2758 452.0834 466.7350 505.9385 507.7907 530.0815 545.3310 560.3001 597.4167 620.7948 651.8636 680.0334 686.1244 701.3832 711.5482 723.9213 729.1363 760.2064 786.5757 790.0531 829.2578 837.0805 853.4458 874.3280 886.1511 895.4021 915.9529 922.0699 940.9745 952.6597 980.8516 989.9345 1016.5417 1057.9308 1066.1449 1080.4630 1090.0214 1111.2642 1111.9531 1114.6866 1118.8445 1130.6744 1141.1605 1151.3414 1154.7767 1155.7716 1168.2972 1179.7410 1190.8374 1201.9134 1210.5547 1214.5318 1256.3684 1261.0862 1269.8465 1280.4046 1304.4163 1307.0909 1323.0520 1340.5426 1354.9102 1365.7381 1380.2375 1396.1117 1406.8454 1407.9872 1419.1467 1425.1810 1435.5199 1439.4168 1443.7043 1450.8603 1453.3940 1455.3230 1456.8232 1457.7566 1460.5628 1469.6682 1475.0661 1481.6805 1485.2417 1505.1274 1575.4465 1582.3710 1597.3332 1616.3244 2951.2566 2970.9612 2971.4040 2975.3814 2987.4382 2990.9640 2996.0037 2999.7027 3055.8482 3063.2532 3071.4131 3075.0840 3079.1449 3094.0861 3098.5494 3120.6045 3120.7076 3121.4512 3124.0222 3148.0045 3158.1194 3198.7443 3577.2404
redmass: 3.8813 4.3117 3.6941 3.6255 2.5655 3.5661 3.1194 4.0097 1.8093 1.2544 1.1428 1.8760 2.4448 3.4048 1.6432 2.3867 5.7694 3.6172 2.6852 3.9669 4.0770 3.0672 4.4149 3.7515 5.0935 1.9359 1.9271 4.7759 3.6323 4.5081 4.3009 6.2365 4.5786 3.6670 3.3989 3.2236 4.5486 4.9952 3.7543 4.2125 7.0518 4.4039 5.3338 6.5462 5.6017 3.5083 5.0634 4.4409 4.6546 4.5032 4.8247 3.1003 2.0507 2.7424 5.3880 2.2104 2.1986 3.1126 1.5638 2.6940 3.5912 4.5413 4.8511 2.7445 2.3568 3.5051 2.9580 2.4111 2.6684 1.2442 1.2502 1.2397 2.0701 1.5357 1.5526 1.3666 1.3661 1.4202 1.7645 1.6102 1.4976 2.2878 1.3534 2.5974 1.3983 1.6054 2.5095 1.5072 1.5960 2.0764 2.3544 2.5043 1.3707 5.8546 2.9991 3.5056 1.4704 1.8732 1.3723 1.1339 1.3008 1.0654 1.5465 2.2893 1.1155 1.1219 1.0582 1.1205 1.0957 1.0609 1.0562 1.0561 1.0541 3.5516 8.9484 6.6114 7.5356 7.3353 1.0815 1.0324 1.0345 1.0297 1.0619 1.0508 1.0613 1.0502 1.0980 1.0988 1.1020 1.1053 1.0971 1.1012 1.0906 1.1029 1.0957 1.1029 1.1042 1.0920 1.1022 1.0914 1.0660
irintensity: 0.9573 0.4779 5.1006 0.9453 4.8119 6.7436 6.6225 9.0021 2.1544 1.0324 1.4684 4.1630 3.3169 1.6918 2.0797 2.9890 1.8772 4.2956 2.5978 2.8129 1.8012 4.7887 5.0401 3.3037 23.7541 46.6871 82.1721 7.8877 9.8057 3.6394 13.5177 7.4373 11.0215 2.9126 9.2086 16.1870 0.5546 1.4514 3.4430 1.4084 16.9720 20.8103 10.9469 4.1014 4.3624 3.4399 0.3652 3.2834 16.0112 10.7130 3.1684 2.3762 11.6970 6.5008 21.5210 12.6379 10.5366 1.9699 38.6071 13.9272 40.3300 74.3257 55.1875 3.7610 13.0538 63.4614 74.1922 13.0366 4.5360 9.3882 5.1184 2.0385 82.1749 29.6510 2.6486 1.4058 20.8552 11.0973 11.9824 26.8485 13.0955 192.5758 12.0646 23.5813 17.5654 51.0359 94.7117 44.6590 9.8620 63.1902 7.3424 54.9869 3.3566 19.5368 60.7742 20.4698 3.0591 41.8673 3.5363 27.0179 19.1884 4.2444 29.9163 19.8722 9.6544 28.3724 3.9154 22.0541 2.6884 36.0527 4.3293 31.0569 23.1555 94.7728 35.6495 52.7859 25.5622 16.4373 12.9055 64.7362 130.1739 49.5860 20.8338 1.1767 9.9294 66.6199 20.4176 37.4299 25.4151 24.5094 39.5412 18.5309 22.4041 23.5916 15.2791 19.7128 19.3778 4.2034 9.8257 6.4376 50.3650
temp: 298.150 k
press: 1.00000 atm
elementType: 8 8 8 8 8 7 6 6 6 6 6 6 6 6 6 6 6 6 6 6 6 6 6 6 6 6 1 1 1 1 1 1 1 1 1 1 1 1 1 1 1 1 1 1 1 1 1 1 1
symmnumber: 1
zpe: 1030756.8 jmol-1
zpe.correction: 0.392595 hartree
zpe.thermalcorrener: 0.417581 hartree
zpe.thermalcorrenthalpy: 0.418526 hartree
zpe.thermalcorrgfe: 0.339186 hartree
zpe.sumelectzpe: -1204.756729 hartree
zpe.sumelectthermal: -1204.731742 hartree
zpe.sumelectthermalent: -1204.730798 hartree
zpe.sumelectthermalfe: -1204.810138 hartree
dipole: -0.6750 -2.1515 -4.1084
dipole: 4.6865
quadrupole: -148.9600 -131.2553 -152.2658
quadrupole: 9.4581 -13.0533 7.0198
quadrupole: -4.7996 12.9050 -8.1054 9.4581 -13.0533 7.0198
hfenergy: -1205.1493235 hartree
pointgroup: C01 [X(C20H23N1O5)]
dipole: -0.3661235 0.8440075 1.5978914 debye
polarizability: 338.1659461|-7.6349707|289.2321331|11.6213307|-9.3622483|151.399334 unknown
InChI: InChI=1S/C20H23NO5/c1-21(23)6-5-11-9-17(25-3)20(26-4)19-13-10-16(24-2)15(22)8-12(13)7-14(21)18(11)19/h8-10,14,22H,5-7H2,1-4H3
charge 0 multiplicity 1
49 atoms
O  3.007683 2.671086 -1.232866
O  -0.525507 -2.88214 -0.392721
O  2.095394 -3.957749 -0.175111
O  -4.584759 -0.802486 0.067508
O  -4.736367 1.946649 -0.805417
N  2.589413 2.574629 0.124041
C  1.278113 1.737371 0.258327
C  1.524467 0.23189 0.133225
C  3.688241 1.896314 0.972223
C  0.273203 2.178036 -0.817062
C  4.039631 0.568613 0.312022
C  2.822881 -0.329129 0.19791
C  0.369253 -0.599874 -0.061715
C  -1.019304 1.414146 -0.602515
C  2.364789 3.974591 0.683176
C  -0.968037 0.043332 -0.201888
C  2.985201 -1.730152 0.118267
C  0.567871 -2.00783 -0.167461
C  1.870322 -2.567829 -0.047206
C  -2.267786 2.041791 -0.78422
C  -2.193657 -0.629337 0.049043
C  -3.480656 1.347346 -0.577008
C  -3.443305 -0.002423 -0.127532
C  -0.581253 -3.42124 -1.773086
C  1.450901 -4.80276 0.856869
C  -5.668127 -0.254083 0.90881
H  0.872534 1.966011 1.26772
H  3.310183 1.767577 2.005232
H  4.543888 2.590688 0.963115
H  0.741969 1.975902 -1.79954
H  0.082656 3.26391 -0.769749
H  4.849613 0.071002 0.875217
H  4.413889 0.811619 -0.702014
H  2.090125 3.947198 1.753913
H  3.306613 4.520848 0.531468
H  1.577606 4.456582 0.088435
H  3.978446 -2.186855 0.179832
H  -2.296682 3.092431 -1.106078
H  -2.194699 -1.670971 0.37202
H  -0.71601 -2.595839 -2.496323
H  -1.457908 -4.08645 -1.795161
H  0.34079 -3.986111 -2.001062
H  -4.619543 2.853619 -1.183164
H  1.868572 -4.566757 1.854546
H  1.702372 -5.838708 0.582388
H  0.357044 -4.654571 0.859149
H  -6.100739 0.654682 0.459414
H  -5.291578 -0.030294 1.926262
H  -6.419646 -1.056872 0.958666
