program: Gaussian 09
title: 000180786
version: EM64L-G09RevD.01
frameworkgroup: C1[X(C15H13F17N2O3S)]
method: RPBEPBE
basis: SDD
operation: Freq
keyword: #p
keyword: freq=noraman
keyword: PBEPBE/SDD
title: #p freq=noraman PBEPBE/SDD
converged: YES YES NO NO
title: Mulliken charges:
elementType: S F F F F F F F F F F F F F F F F F O O O N N C C C C C C C C C C C C C C C H H H H H H H H H H H H H
charge: 1.066061 -0.120102 -0.114256 -0.121872 -0.119074 -0.121843 -0.117480 -0.120075 -0.124295 -0.073557 -0.104654 -0.118815 -0.118673 -0.122360 -0.120508 -0.122866 -0.120179 -0.125572 -0.508797 -0.436692 -0.269305 -0.406291 -0.735972 -0.047964 -0.443790 -0.415453 -0.410378 -0.406456 -0.378536 0.263691 0.249230 0.280507 0.244982 0.073924 0.257695 0.207954 0.423354 0.373795 0.259630 0.219333 0.208372 0.201041 0.247302 0.174540 0.216620 0.213423 0.198425 0.198086 0.207610 0.298660 0.361579
chargesum: 0.00000
title: Mulliken charges with hydrogens summed into heavy atoms:
elementType: S F F F F F F F F F F F F F F F F F O O O N N C C C C C C C C C C C C C C C
charge: 1.066061 -0.120102 -0.114256 -0.121872 -0.119074 -0.121843 -0.117480 -0.120075 -0.124295 -0.073557 -0.104654 -0.118815 -0.118673 -0.122360 -0.120508 -0.122866 -0.120179 -0.125572 -0.508797 -0.436692 -0.269305 -0.107631 -0.374393 0.211666 -0.016085 0.032891 -0.019217 0.005393 0.027160 0.263691 0.249230 0.280507 0.244982 0.073924 0.257695 0.207954 0.423354 0.373795
polarizability: 2.78919334e+02 1.88448212e+01 2.14597868e+02 -2.83184248e+00 -1.32812033e-01 1.97942122e+02
1716.lowfreq: -27.5343 -4.2760 -1.2015 -0.0003 0.0006 0.0011 4.3727 14.1141 17.9380
frequency: -26.5631 13.8468 17.6554 23.0247 28.7319 39.3189 47.1012 52.3458 55.8735 66.3029 71.7457 80.8496 87.0961 96.2878 114.2447 119.3961 124.0836 129.6524 133.7618 147.0178 152.8881 162.6041 170.5717 189.9470 200.0146 201.7976 207.1576 215.3380 220.9286 225.6858 232.0439 243.0677 243.8987 252.2601 256.0184 275.9127 277.6331 280.9211 287.9845 292.4683 294.5504 300.0595 305.2798 316.3570 329.7116 331.4190 333.1070 343.1555 364.6664 371.9090 380.0934 405.7670 408.8483 421.3670 432.6399 443.8454 452.6234 462.8898 472.3976 476.3373 509.3431 512.7050 518.8723 546.3299 555.8468 571.6872 587.2456 589.3572 608.6000 625.2887 653.2208 657.5514 688.3619 696.4405 740.9415 773.1100 800.9703 812.2421 829.6941 832.5075 859.3061 864.5207 870.3127 915.0278 920.4526 952.5772 963.8779 977.4127 984.4390 987.6947 1002.0895 1009.2179 1019.9188 1027.9510 1032.0770 1037.3404 1039.2428 1045.5945 1049.2395 1052.0291 1055.0423 1077.6958 1085.0646 1088.8203 1100.7926 1113.1373 1115.1407 1120.5039 1130.7029 1141.6122 1142.4244 1152.8212 1154.3305 1162.8721 1179.1664 1188.9312 1239.4997 1258.5771 1270.2368 1292.5820 1311.3347 1329.7889 1333.3839 1336.3107 1349.2155 1357.0313 1367.1336 1456.2517 1458.7813 1461.8995 1470.8978 1473.0809 1486.7681 1632.7239 2947.9632 2969.2941 2971.7753 2982.4911 2987.6271 3030.7193 3034.2121 3037.6932 3042.4829 3048.5290 3058.1817 3500.2635 3553.7639
redmass: 3.6851 8.4596 10.2770 11.5171 12.3350 12.0073 8.5639 10.9332 6.1225 6.2046 11.2955 15.8295 14.2954 7.8577 16.8809 14.9014 7.9695 15.9504 16.3646 10.6674 10.9999 7.4869 15.6449 16.8909 10.5106 2.6326 12.6458 13.4308 5.9079 7.9212 10.2198 17.8223 13.8243 15.1456 16.8047 12.4034 17.2811 5.4640 18.0209 11.1355 3.0411 16.9337 18.3448 18.5855 9.2314 3.0782 3.6280 8.1240 3.3222 2.2821 7.0601 15.9875 8.9904 16.7632 4.5892 15.9335 2.4460 17.4346 4.3124 2.5462 1.5392 17.1534 17.1887 15.8938 16.9141 16.9549 17.5732 17.5744 17.0163 2.5419 12.3287 8.2865 8.1835 10.6792 5.9109 1.4918 3.5470 13.4834 11.5533 1.7518 2.4079 13.3191 2.2080 13.2587 1.4450 2.7095 12.3947 9.2394 13.4810 12.5437 3.2296 13.3199 2.8714 12.9249 12.5020 13.2073 13.0621 1.4172 12.9135 12.3764 1.8187 13.2179 13.1422 1.7333 12.2047 12.0293 1.0569 12.5386 12.1866 2.4820 8.4882 2.8398 3.3111 6.0829 2.0344 12.3343 1.3342 1.2707 1.2779 1.4717 1.5184 1.3373 1.5745 1.5464 1.4613 1.4924 1.4034 1.1592 1.2130 1.2461 1.0995 1.0944 1.1738 8.4959 1.0677 1.0674 1.0604 1.0632 1.0618 1.0913 1.0931 1.0919 1.0989 1.1016 1.1002 1.0794 1.0772
irintensity: 0.0568 0.4907 0.0603 0.5304 0.1650 0.1969 0.1962 0.5803 0.5047 0.2917 1.0331 1.9762 0.1120 5.5326 0.3594 0.4827 2.8099 1.0848 0.8492 2.6138 0.6456 4.3680 3.2574 27.3454 1.8547 4.2281 9.2282 4.5973 0.0968 6.0486 2.2084 1.3993 3.3021 1.4420 1.2403 3.4647 2.3404 1.9251 1.3775 0.8911 5.1837 0.0641 0.3318 0.2989 1.5055 9.0882 6.1873 10.2247 33.0858 1.8234 0.3739 8.1700 79.6863 3.5630 94.2432 1.5303 26.5371 13.1794 2.0263 21.6619 125.3741 2.2990 0.3258 13.6387 2.5563 11.1698 0.3587 1.0357 12.9737 17.5111 145.3848 79.2695 49.5626 16.2687 30.2864 1.2053 10.5177 236.8560 111.3693 12.8843 7.9229 30.6717 4.2890 60.3851 16.6859 37.7585 107.3358 57.4656 1.0869 51.9206 47.0600 177.4602 25.0556 21.6654 59.8945 11.2963 97.8951 0.9371 124.8709 113.9657 3.4269 220.5925 332.5804 1.2486 100.6530 23.9465 0.9120 157.1727 27.8489 7.0363 11.0964 11.3032 7.0353 48.8635 69.8984 47.3612 21.5871 3.7210 25.0991 14.5045 54.4111 0.4341 54.2705 51.5274 20.6576 14.5088 33.2929 107.5234 111.9304 200.5141 18.4628 52.2730 95.3937 176.8027 37.2182 21.6109 41.6180 18.9825 26.7068 63.8204 73.4240 9.1640 33.5514 54.7850 51.4719 38.4988 44.6858
temp: 298.150 k
press: 1.00000 atm
elementType: 16 9 9 9 9 9 9 9 9 9 9 9 9 9 9 9 9 9 8 8 8 7 7 6 6 6 6 6 6 6 6 6 6 6 6 6 6 6 1 1 1 1 1 1 1 1 1 1 1 1 1
symmnumber: 1
zpe: 774370.8 jmol-1
zpe.correction: 0.294942 hartree
zpe.thermalcorrener: 0.333825 hartree
zpe.thermalcorrenthalpy: 0.334769 hartree
zpe.thermalcorrgfe: 0.221833 hartree
zpe.sumelectzpe: -3006.740109 hartree
zpe.sumelectthermal: -3006.701227 hartree
zpe.sumelectthermalent: -3006.700283 hartree
zpe.sumelectthermalfe: -3006.813218 hartree
dipole: -4.6749 -5.4130 2.2064
dipole: 7.4849
quadrupole: -186.6670 -236.9716 -229.8584
quadrupole: 22.0192 -13.9671 -2.3205
quadrupole: 31.1653 -19.1392 -12.0261 22.0192 -13.9671 -2.3205
hfenergy: -3007.0350514 hartree
pointgroup: C01 [X(C15H13F17N2O3S1)]
dipole: -1.6839888 2.2717624 -0.8215984 debye
polarizability: 276.3508007|-22.394854|216.8367781|5.1388855|-0.2630945|198.2717454 unknown
InChI: InChI=1S/C15H13F17N2O3S/c16-8(17,10(20,21)12(24,25)14(28,29)30)9(18,19)11(22,23)13(26,27)15(31,32)38(36,37)34-7(35)33-6-4-2-1-3-5-6/h6,33-34H,1-5H2
charge 0 multiplicity 1
51 atoms
S  -2.458655 -2.111318 -0.918167
F  2.83954 -2.444696 0.023868
F  1.511477 -2.527947 1.87447
F  1.22855 0.203284 1.913683
F  3.350988 -0.628005 2.079778
F  0.283611 -3.308321 -0.38983
F  0.805579 -1.366823 -1.492856
F  1.676033 1.105399 -0.625232
F  3.124863 1.853747 0.970621
F  -1.13366 -1.652702 1.565883
F  -0.890529 0.067156 0.072958
F  3.621717 -0.524112 -1.723526
F  4.09296 1.701547 -1.575015
F  6.245284 0.065195 -1.461603
F  5.414066 -1.115464 0.307962
F  6.08422 2.471466 0.212285
F  7.509169 0.79786 0.770849
F  5.606491 1.097216 1.958204
O  -1.934913 -2.480086 -2.405363
O  -3.2204 -3.17993 0.00832
O  -3.685518 -0.130109 1.043999
N  -4.956458 1.029724 -0.551963
N  -3.429471 -0.62368 -1.225925
C  -5.611457 1.930009 0.436114
C  -6.025428 3.249021 -0.261124
C  -6.831305 1.244359 1.108929
C  -7.213643 3.06049 -1.238449
C  -8.012205 1.053558 0.128769
C  -8.419188 2.39252 -0.533817
C  1.77698 -1.796244 0.694148
C  2.290955 -0.383004 1.178323
C  0.495035 -1.915229 -0.230205
C  2.782769 0.733387 0.171075
C  -0.8538 -1.311117 0.25808
C  3.987289 0.504178 -0.82678
C  5.438122 0.156036 -0.304464
C  -4.030568 0.094327 -0.150537
C  6.16114 1.155107 0.676462
H  -4.848993 2.133931 1.20951
H  -5.152738 3.691862 -0.778303
H  -6.327994 3.962947 0.529585
H  -7.154728 1.885487 1.954041
H  -6.510219 0.279542 1.541438
H  -6.909283 2.439079 -2.109594
H  -7.505591 4.041948 -1.657554
H  -8.874535 0.615501 0.665668
H  -7.73031 0.321781 -0.656522
H  -8.80618 3.080331 0.246191
H  -9.242449 2.231022 -1.255617
H  -5.284954 1.054098 -1.518303
H  -3.47476 -0.379528 -2.222162
