program: Gaussian 09
title: 000012691
version: EM64L-G09RevD.01
frameworkgroup: C1[X(C3H3ClO)]
method: RPBEPBE
basis: SDD
operation: Freq
keyword: #p
keyword: freq=noraman
keyword: PBEPBE/SDD
title: #p freq=noraman PBEPBE/SDD
converged: NO YES NO NO
title: Mulliken charges:
elementType: Cl O C C C H H H
charge: -0.027820 -0.096229 -0.661942 -0.158084 0.213370 0.249301 0.249309 0.232094
chargesum: 0.00000
title: Mulliken charges with hydrogens summed into heavy atoms:
elementType: Cl O C C C
charge: -0.027820 -0.096229 0.068763 -0.158084 0.213370
polarizability: 6.25417489e+01 3.08970897e+00 4.25581842e+01 -8.79846316e-04 -2.61002125e-03 2.24940668e+01
1716.lowfreq: -15.1078 -7.6799 -5.3196 -0.0014 0.0008 0.0021 155.1762 157.2107 252.9329
frequency: 155.1761 157.2055 252.9325 275.0919 430.4843 522.2243 631.9308 924.8093 1033.2071 1065.2963 1336.0218 1394.5660 1446.8721 1472.0815 2107.8103 2979.5829 3071.2572 3087.0009
redmass: 9.1935 1.0854 3.8695 3.4072 11.4087 12.4092 7.0746 2.4631 1.3160 2.3059 7.1182 1.1836 1.0416 1.0679 12.1901 1.0342 1.1010 1.0990
irintensity: 2.8668 0.2107 5.4795 1.0929 9.5896 11.2173 2.4785 2.8706 2.8359 39.9783 35.3573 8.7437 16.8870 9.7509 393.4835 19.1393 17.0274 12.5412
temp: 298.150 k
press: 1.00000 atm
elementType: 17 8 6 6 6 1 1 1
symmnumber: 1
zpe: 133644.1 jmol-1
zpe.correction: 0.050902 hartree
zpe.thermalcorrener: 0.056706 hartree
zpe.thermalcorrenthalpy: 0.057651 hartree
zpe.thermalcorrgfe: 0.021149 hartree
zpe.sumelectzpe: -650.972818 hartree
zpe.sumelectthermal: -650.967013 hartree
zpe.sumelectthermalent: -650.966069 hartree
zpe.sumelectthermalfe: -651.002571 hartree
dipole: 0.6094 2.1994 0.0005
dipole: 2.2823
quadrupole: -40.1084 -32.6719 -36.4425
quadrupole: -1.1554 0.0016 0.0008
quadrupole: -3.7008 3.7357 -0.0349 -1.1554 0.0016 0.0008
hfenergy: -651.0237199 hartree
pointgroup: C01 [X(C3H3Cl1O1)]
dipole: -0.52888 -0.7256204 0.0001938 debye
dipolederiv: -0.2163329 0.1288865 0.0001847 0.1183758 -0.4267969 -0.0002188 0.0003662 -0.0003836 -0.0061871 -1.4682138 -0.020838 0.0004447 -0.0602818 -0.1406679 0.000024 -0.0002921 0.0000018 -0.122732 0.0761102 0.0939735 0.0000885 0.1424777 -0.0851743 -0.0001436 0.0002937 -0.0000543 0.1461753 -0.2676082 -0.162019 -0.0003324 -0.259657 0.5609023 0.0004641 -0.000907 0.0004615 -0.2930655 1.8834369 0.0156727 -0.0004076 0.0889774 -0.0311358 -0.0001199 0.000459 -0.0000913 0.1998935 -0.0143742 -0.0721362 0.1020259 -0.0519727 0.0859736 -0.015414 0.1093653 0.0084253 -0.0322193 -0.0147202 -0.072128 -0.1021306 -0.0518318 0.0860099 0.0155283 -0.1093974 -0.0082657 -0.0318525 0.0217022 0.0885883 0.0001269 0.0739125 -0.0491108 -0.00012 0.0001123 -0.0000937 0.1399876 unknown
polarizability: 62.1031508|-4.2565824|42.9967702|-0.0179773|0.0111546|22.4940788 unknown
InChI: InChI=1S/C3H3ClO/c1-3(4)2-5/h1H3
charge 0 multiplicity 1
8 atoms
Cl -1.30686 1.513404 0.0013
O  2.118166 0.030203 -0.000585
C  -1.264903 -1.35001 0.00038
C  -0.422798 -0.101604 -0.000231
C  0.906695 -0.025709 -0.000712
H  -1.908291 -1.387108 0.8983
H  -1.909912 -1.386792 -0.896387
H  -0.624098 -2.249883 -0.000366
