program: Gaussian 09
title: 000180690
version: EM64L-G09RevD.01
frameworkgroup: C1[X(C16H26NO5P)]
method: RPBEPBE
basis: SDD
operation: Freq
keyword: #p
keyword: freq=noraman
keyword: PBEPBE/SDD
title: #p freq=noraman PBEPBE/SDD
converged: NO YES NO NO
title: Mulliken charges:
elementType: P O O O O O N C C C C C C C C C C C C C C C C H H H H H H H H H H H H H H H H H H H H H H H H H H
charge: 1.357838 -0.539673 -0.471532 -0.593600 -0.282732 -0.307264 -0.808820 -0.317496 -0.340283 -0.339638 -0.689536 0.260807 0.114155 -0.247935 0.039538 -0.325993 -0.320887 0.224887 -0.197670 -0.241141 -0.645797 -0.680961 -0.681458 0.187472 0.202950 0.212592 0.242406 0.201768 0.190300 0.424521 0.208145 0.216581 0.213692 0.215860 0.225084 0.234415 0.279998 0.263592 0.236512 0.234765 0.221411 0.217662 0.247599 0.222971 0.237301 0.210010 0.200042 0.231115 0.256424
chargesum: 0.00000
title: Mulliken charges with hydrogens summed into heavy atoms:
elementType: P O O O O O N C C C C C C C C C C C C C C C C
charge: 1.357838 -0.539673 -0.471532 -0.593600 -0.282732 -0.307264 -0.384300 0.072927 0.114715 0.052430 -0.051118 0.260807 0.114155 0.193010 0.273954 -0.045995 -0.057296 0.224887 0.038843 -0.006376 0.041784 0.005711 -0.011175
polarizability: 2.49452596e+02 1.49985608e-01 2.41928506e+02 2.12560648e+01 2.16953849e+01 1.90642246e+02
1716.lowfreq: -25.0388 -11.2932 -6.1100 -3.8111 -0.0011 0.0009 0.0014 12.8394 21.3291
frequency: -24.7733 12.5473 20.7190 26.1889 41.7273 48.1320 51.1943 59.8215 77.9307 80.7770 97.2441 107.2739 111.6091 121.9019 144.3111 170.3238 174.4509 189.7105 197.6615 204.3617 212.7728 229.8230 232.4755 235.8317 265.0643 280.5856 309.5254 339.5129 357.4491 380.4358 392.1492 398.2517 416.7026 427.2687 439.0927 459.8268 460.2529 504.0080 525.2494 562.0571 601.7922 630.7080 655.4328 684.6369 732.6634 749.9264 760.2359 768.9414 772.3988 786.2671 794.9083 803.6178 818.7725 849.2385 870.5544 883.4064 900.4503 901.2093 925.7702 931.2962 942.9347 965.0381 993.3243 1003.9011 1015.4253 1034.4017 1048.3222 1054.4614 1068.6416 1093.7917 1099.9888 1111.6764 1119.8094 1126.4389 1143.6787 1153.5473 1157.7580 1174.4704 1182.3558 1201.7967 1222.0941 1242.8292 1262.8118 1269.9080 1271.5509 1283.1642 1298.2205 1327.3285 1334.6201 1343.6025 1348.3267 1362.4482 1379.2946 1380.0302 1390.6260 1394.4627 1397.4350 1425.6305 1454.6826 1457.0981 1458.2426 1461.7994 1465.6165 1466.3996 1468.2439 1471.2626 1473.2061 1476.7869 1477.4301 1485.2674 1487.1856 1488.1834 1567.9319 1586.0409 1607.7525 2964.1612 2970.3997 2974.3687 2982.4838 2985.8366 2990.2321 2990.7089 2994.4091 3004.7665 3026.0821 3032.5216 3052.0459 3069.9872 3070.8708 3073.3670 3084.9442 3085.7300 3094.7697 3100.0768 3104.8924 3113.6201 3139.4825 3156.3677 3172.1457 3179.8706 3311.2888
redmass: 2.4887 4.5716 4.0691 3.0812 2.9316 1.8636 3.7418 3.6474 3.7161 4.1565 5.2466 2.6033 3.8733 4.5156 2.9182 4.9221 3.0860 3.5844 1.0320 2.4640 2.7893 1.3798 1.4445 1.5427 3.3868 4.4023 6.8970 5.6880 3.4062 4.5477 4.1416 4.2744 3.5335 3.6245 4.3062 3.9007 3.5214 4.5995 4.5119 4.8456 7.0741 6.4619 6.1127 5.1089 1.0983 1.5108 3.4602 1.7617 1.5788 2.4833 5.1730 1.1474 1.8250 6.1346 3.2603 1.4720 1.7375 2.7551 1.2148 1.2198 1.3601 1.3829 1.3389 4.3256 3.0948 3.1710 3.5341 7.2600 2.5023 2.1627 1.7218 2.5142 4.2010 1.8793 1.5327 1.7896 2.0558 1.0748 1.9591 3.2855 1.3621 3.0278 1.2839 1.1282 1.4657 1.0791 1.1130 1.5174 1.3734 1.4287 1.2350 1.3714 2.0055 2.5561 1.2248 1.2156 1.2316 2.2051 1.0620 1.0623 1.1464 1.0685 1.0543 1.1526 1.0765 1.9048 1.1492 1.0551 1.0515 1.0580 1.0831 1.0506 7.2115 7.9762 6.7965 1.0587 1.0595 1.0369 1.0605 1.0511 1.0356 1.0490 1.0359 1.0987 1.1024 1.0865 1.1054 1.1013 1.1005 1.0997 1.0966 1.0993 1.0988 1.1008 1.1004 1.1021 1.0865 1.0912 1.0948 1.0996 1.0813
irintensity: 1.0120 0.4033 0.0370 0.5642 0.8630 0.5637 1.5020 1.5836 2.0846 0.7286 0.8652 0.8626 3.5448 4.1117 1.7079 0.0460 0.9832 5.6720 0.0499 0.6793 4.3764 1.6802 1.5192 2.2021 8.8744 8.2058 18.2567 5.1197 0.4596 13.5435 8.6331 16.8111 8.7234 15.9459 14.2945 10.5119 9.5168 36.1068 3.1303 4.4215 24.1012 102.7794 38.8585 21.2395 18.8722 141.4777 19.8900 51.6358 91.5988 22.1501 64.5106 10.7524 40.3891 130.5217 143.4229 3.8769 15.7130 19.1807 2.5964 6.3340 0.1077 2.1937 1.4121 15.6585 102.4456 107.9890 285.9705 50.4214 1.2715 11.0096 107.7561 44.2216 116.6361 27.9833 5.1906 25.6057 12.2400 8.5001 40.8452 104.9871 10.6543 362.4833 2.0790 0.3261 18.0675 0.6239 5.9248 12.0695 3.5332 1.8860 6.9449 16.0080 22.5467 17.4912 25.3854 8.7487 17.5427 19.7503 23.0853 21.9029 50.5468 1.3291 11.5486 73.5420 4.0219 39.7180 34.3872 7.0008 9.8419 4.0570 17.8577 19.7708 61.4107 124.4454 177.0679 7.2883 20.6558 39.7692 76.1056 22.6393 15.1516 34.9120 23.6613 1.7370 8.5884 4.8259 27.6677 9.4164 81.3078 59.5925 28.0191 6.6962 49.8795 14.5971 34.2349 29.1605 3.5610 15.2082 3.3660 12.2232 489.1768
temp: 298.150 k
press: 1.00000 atm
elementType: 15 8 8 8 8 8 7 6 6 6 6 6 6 6 6 6 6 6 6 6 6 6 6 1 1 1 1 1 1 1 1 1 1 1 1 1 1 1 1 1 1 1 1 1 1 1 1 1 1
symmnumber: 1
zpe: 1052074.7 jmol-1
zpe.correction: 0.400714 hartree
zpe.thermalcorrener: 0.427145 hartree
zpe.thermalcorrenthalpy: 0.428089 hartree
zpe.thermalcorrgfe: 0.340933 hartree
zpe.sumelectzpe: -1395.611294 hartree
zpe.sumelectthermal: -1395.584864 hartree
zpe.sumelectthermalent: -1395.583920 hartree
zpe.sumelectthermalfe: -1395.671076 hartree
dipole: -3.6894 5.5194 -0.9335
dipole: 6.7043
quadrupole: -136.1467 -143.2709 -139.8905
quadrupole: 7.5185 4.2692 6.1128
quadrupole: 3.6227 -3.5015 -0.1212 7.5185 4.2692 6.1128
hfenergy: -1396.0120085 hartree
pointgroup: C01 [X(C16H26N1O5P1)]
dipole: -1.6116639 1.2994061 -1.634417 debye
polarizability: 245.7985727|13.592029|247.0155293|19.4734579|-17.0860209|189.2092459 unknown
InChI: InChI=1S/C16H26NO5P/c1-5-7-12-17-23(19,20-6-2)22-15-11-9-8-10-14(15)16(18)21-13(3)4/h8-11,13,17H,5-7,12H2,1-4H3
charge 0 multiplicity 1
49 atoms
P  1.890772 -0.620004 1.262547
O  0.130138 -0.582708 1.554404
O  2.359714 0.506146 2.4823
O  2.64391 -2.00315 1.451334
O  -3.063041 0.696949 -0.803935
O  -0.773174 1.05068 -0.662041
N  1.898036 0.069039 -0.298012
C  3.966285 1.063391 -1.371992
C  2.989604 -0.130516 -1.271327
C  5.063227 0.828921 -2.434941
C  6.047156 2.0133 -2.550783
C  -0.732225 -1.525977 0.97084
C  -1.748112 -1.087384 0.070482
C  2.089602 1.965988 2.33522
C  -3.228372 2.050385 -1.459159
C  -0.661133 -2.880196 1.371484
C  -2.72383 -2.027394 -0.363036
C  -1.773893 0.300384 -0.471037
C  -1.615959 -3.802447 0.896849
C  -2.659074 -3.374735 0.03957
C  0.717462 2.35372 2.89209
C  -2.971553 1.90238 -2.965454
C  -4.649439 2.492617 -1.106215
H  3.397234 1.982694 -1.619174
H  4.435113 1.232674 -0.381627
H  2.531335 -0.321858 -2.261947
H  3.54401 -1.04779 -0.993991
H  5.624217 -0.094304 -2.184211
H  4.586631 0.646517 -3.420133
H  1.025086 0.554395 -0.574033
H  5.518025 2.94339 -2.832286
H  6.822753 1.821266 -3.314804
H  6.559738 2.197397 -1.587972
H  2.194129 2.253399 1.269941
H  2.908784 2.427221 2.912816
H  -2.47124 2.717703 -1.007929
H  0.138839 -3.186053 2.052473
H  -3.518217 -1.682064 -1.030598
H  -1.552565 -4.851276 1.206255
H  -3.410139 -4.088211 -0.314108
H  -3.681298 1.18421 -3.412989
H  -3.106388 2.879004 -3.465339
H  -1.941624 1.558475 -3.158758
H  -5.392896 1.787776 -1.518098
H  -4.785482 2.543897 -0.0128
H  -4.845439 3.493631 -1.531121
H  0.600984 3.4541 2.855975
H  0.619315 2.026933 3.941309
H  -0.092307 1.890489 2.304662
