program: Gaussian 09
title: 000180662
version: EM64L-G09RevD.01
frameworkgroup: C1[X(C13H19NOS)]
method: RPBEPBE
basis: SDD
operation: Freq
keyword: #p
keyword: freq=noraman
keyword: PBEPBE/SDD
title: #p freq=noraman PBEPBE/SDD
converged: YES YES NO NO
title: Mulliken charges:
elementType: S O N C C C C C C C C C C C C C H H H H H H H H H H H H H H H H H H H
charge: 0.098335 -0.227345 -0.327976 -0.372480 -0.558174 -0.402694 0.503854 -0.403301 -0.418028 -0.633764 -0.302666 -0.017593 -0.226893 -0.225049 -0.242959 -0.673753 0.219379 0.249055 0.196751 0.215878 0.210099 0.258662 0.319899 0.235475 0.228975 0.248417 0.289696 0.208201 0.229226 0.224355 0.223256 0.227388 0.206974 0.220254 0.218544
chargesum: 0.00000
title: Mulliken charges with hydrogens summed into heavy atoms:
elementType: S O N C C C C C C C C C C C C C
charge: 0.098335 -0.227345 -0.008077 0.095954 -0.145545 0.066067 0.503854 -0.167825 -0.189053 -0.095651 0.134761 -0.017593 -0.002537 -0.001793 -0.015571 -0.027981
polarizability: 2.24111358e+02 1.47597990e+01 1.57626572e+02 9.30471245e+00 -1.05706443e+00 1.20202811e+02
1716.lowfreq: -5.3741 0.0006 0.0014 0.0018 1.3039 8.9288 11.9513 16.7756 25.8102
frequency: 11.3432 16.4988 25.5253 29.9964 47.0259 52.6688 74.0920 94.2764 127.4600 174.7787 225.7511 227.7121 236.9003 258.8897 275.5887 333.0008 335.7004 384.2915 403.3490 437.2870 461.7248 496.4194 526.1981 591.0958 617.8589 628.2337 683.9566 705.3705 729.8329 736.6078 758.4893 769.3862 814.5568 847.2208 853.9808 889.1993 894.6216 897.9564 924.6758 975.9356 989.8153 994.0284 1026.6333 1027.6460 1041.1736 1059.2332 1070.3822 1080.1468 1097.1159 1106.6126 1164.8732 1172.0896 1180.0787 1187.2116 1216.5822 1227.1372 1250.4032 1256.7341 1276.0141 1294.1484 1305.5365 1328.1454 1328.2166 1343.8035 1360.1561 1382.9213 1386.9639 1427.5402 1440.7873 1447.1074 1462.5568 1471.3095 1475.3183 1478.4022 1483.5175 1484.5358 1485.2949 1593.7314 1614.6337 1651.3476 2970.8727 2976.3143 2991.7164 2997.4588 3002.9399 3020.4266 3023.8243 3045.9643 3059.7427 3075.4228 3075.5774 3079.2731 3102.3394 3113.2399 3115.3883 3131.2644 3143.0886 3162.0423 3554.1600
redmass: 4.5648 3.8141 4.1057 4.3905 7.4095 3.8813 1.8541 3.9452 2.6690 3.7851 2.7867 3.4440 1.1751 3.3782 3.0810 2.8623 2.4800 4.8090 2.8187 10.2142 2.3996 3.0170 1.5134 3.5901 6.3634 6.4970 5.0595 1.7786 1.1336 2.4658 1.8333 1.6037 3.0954 1.2266 1.2502 2.5098 1.9669 1.9574 1.6420 1.3874 6.2579 1.3125 2.1831 2.0523 2.8632 2.4574 2.7469 1.3552 1.6222 2.1764 1.3146 1.0571 2.5053 1.1202 2.3208 1.3145 1.3293 1.2077 1.2120 1.0981 1.2598 1.2559 1.4036 1.4090 1.2795 7.7784 1.2039 1.0942 2.1342 1.1553 1.0882 1.0703 1.4743 1.0435 1.8296 1.0697 1.2836 6.0490 6.1720 8.0175 1.0592 1.0353 1.0617 1.0607 1.0627 1.0576 1.0997 1.1009 1.1013 1.1013 1.1035 1.0997 1.1069 1.0871 1.0870 1.0906 1.0958 1.1015 1.0781
irintensity: 0.1399 0.1023 0.1356 0.5132 10.0319 0.1248 0.1979 1.5894 0.2377 1.2089 5.4895 5.0266 0.5960 4.9736 1.1414 13.2513 4.7519 6.7679 0.0124 4.6218 29.4482 23.6728 117.9894 8.2159 0.0946 1.2560 26.0945 49.0387 15.0133 19.9026 36.5686 38.0187 7.0460 1.6296 0.1359 7.1513 39.5545 7.3719 1.9052 0.0453 0.0796 0.0782 3.1288 7.0799 3.5108 15.6915 12.6875 4.5966 10.2078 9.9140 15.1323 0.9325 247.3458 1.9196 0.4038 0.7373 31.1587 0.7413 1.3725 0.9293 27.7170 0.1176 1.4732 4.6746 11.4411 0.0745 11.1705 13.1788 5.9647 60.5715 4.8084 16.7041 221.5813 17.6704 20.3457 14.4827 16.8343 1.2269 10.9657 167.0685 27.4856 38.3361 28.4110 14.8332 40.8453 26.2834 6.4999 0.9595 38.2394 42.3143 18.4853 46.9349 17.4432 9.4818 8.4862 10.4423 45.3875 24.2745 28.7397
temp: 298.150 k
press: 1.00000 atm
elementType: 16 8 7 6 6 6 6 6 6 6 6 6 6 6 6 6 1 1 1 1 1 1 1 1 1 1 1 1 1 1 1 1 1 1 1
symmnumber: 1
zpe: 770911.9 jmol-1
zpe.correction: 0.293625 hartree
zpe.thermalcorrener: 0.311477 hartree
zpe.thermalcorrenthalpy: 0.312421 hartree
zpe.thermalcorrgfe: 0.242382 hartree
zpe.sumelectzpe: -1033.616351 hartree
zpe.sumelectthermal: -1033.598499 hartree
zpe.sumelectthermalent: -1033.597555 hartree
zpe.sumelectthermalfe: -1033.667594 hartree
dipole: -0.7076 -1.3711 1.0570
dipole: 1.8702
quadrupole: -96.8860 -94.1322 -111.0032
quadrupole: 4.5063 3.1229 -1.5459
quadrupole: 3.7878 6.5416 -10.3294 4.5063 3.1229 -1.5459
hfenergy: -1033.9099759 hartree
pointgroup: C01 [X(C13H19N1O1S1)]
dipole: -0.2762424 -0.4021491 0.5508047 debye
polarizability: 221.4360623|21.2417956|155.6978021|8.6139606|-10.6893893|124.8068767 unknown
InChI: InChI=1S/C13H19NOS/c1-2-11-16-13(15)14-10-6-9-12-7-4-3-5-8-12/h3-5,7-8,14H,2,6,9-11H2,1H3
charge 0 multiplicity 1
35 atoms
S  3.259561 0.854489 1.454326
O  2.499864 -0.396268 -0.913827
N  1.379566 -1.056248 1.027469
C  -0.81526 -1.334065 -0.201409
C  -1.728423 -0.742241 0.906133
C  0.466514 -2.001096 0.349352
C  -2.979285 -0.090838 0.333415
C  -2.944602 1.246772 -0.140271
C  -4.193421 -0.815778 0.219813
C  4.503249 1.483221 0.172507
C  5.798738 0.655748 0.14116
C  2.30399 -0.3173 0.326262
C  -4.089968 1.843587 -0.713006
C  -5.342389 -0.223474 -0.352595
C  -5.294156 1.109437 -0.822147
C  6.797062 1.217883 -0.897603
H  -1.381842 -2.092048 -0.777717
H  -0.529061 -0.540896 -0.916774
H  -2.011239 -1.552123 1.60846
H  -1.14783 0.00381 1.48345
H  0.206332 -2.795607 1.074233
H  1.025559 -2.464659 -0.482279
H  1.308934 -0.924487 2.037714
H  -2.014835 1.823692 -0.055561
H  -4.23932 -1.849189 0.586686
H  4.686401 2.538122 0.43952
H  3.974945 1.430953 -0.795835
H  6.263354 0.647198 1.145546
H  5.547345 -0.391944 -0.107913
H  -4.045456 2.878852 -1.070161
H  -6.272931 -0.797752 -0.428531
H  -6.184178 1.571537 -1.263906
H  7.084407 2.258852 -0.656951
H  7.719502 0.609932 -0.923158
H  6.359872 1.212025 -1.913303
