program: Gaussian 09
title: 000180688
version: EM64L-G09RevD.01
frameworkgroup: C1[X(C14H22NO5P)]
method: RPBEPBE
basis: SDD
operation: Freq
keyword: #p
keyword: freq=noraman
keyword: PBEPBE/SDD
title: #p freq=noraman PBEPBE/SDD
converged: YES YES NO NO
title: Mulliken charges:
elementType: P O O O O O N C C C C C C C C C C C C C C H H H H H H H H H H H H H H H H H H H H H H
charge: 1.363937 -0.547674 -0.474512 -0.281829 -0.592992 -0.305144 -0.799020 0.263451 0.114911 -0.296152 0.039437 -0.329245 0.223618 -0.321086 -0.244326 -0.635891 -0.681346 -0.680496 -0.197267 -0.241035 -0.645089 0.425652 0.219085 0.242124 0.234192 0.280606 0.263123 0.213829 0.223772 0.214014 0.210761 0.224125 0.210063 0.237159 0.223131 0.217625 0.247862 0.221435 0.236689 0.234946 0.199303 0.230856 0.257399
chargesum: 0.00000
title: Mulliken charges with hydrogens summed into heavy atoms:
elementType: P O O O O O N C C C C C C C C C C C C C C
charge: 1.363937 -0.547674 -0.474512 -0.281829 -0.592992 -0.305144 -0.373368 0.263451 0.114911 0.165057 0.273628 -0.048639 0.223618 -0.057963 0.193275 0.013009 -0.010994 0.006426 0.039422 -0.006089 0.042469
polarizability: 2.27182338e+02 -3.84915347e-01 2.31467112e+02 5.08156333e+00 -7.43907891e+00 1.55140280e+02
1716.lowfreq: -20.5867 -9.5779 -5.0555 -0.0017 -0.0016 -0.0010 3.6199 17.0402 24.9934
frequency: -19.9240 16.4962 24.9151 32.6090 44.5140 51.5538 58.3059 74.5326 82.7089 96.3796 109.6721 124.2935 157.1759 170.2822 180.9864 187.0671 188.0347 215.9200 227.0863 237.6398 247.5922 263.4651 283.8776 316.5670 355.5771 366.5743 387.1532 392.7982 406.0133 415.9579 427.6931 441.6657 458.9632 497.6483 526.3379 562.8434 603.1453 631.2883 656.2508 684.8395 738.9018 758.1346 768.1334 771.6859 785.6601 794.4756 803.1020 813.7953 850.2439 871.3813 882.1362 901.5770 925.2874 928.1247 941.4336 963.6139 992.6366 1013.8605 1033.6822 1047.9888 1051.9812 1083.3669 1094.6218 1098.6459 1124.3095 1127.3738 1143.3862 1147.1358 1156.8211 1174.0832 1181.9599 1203.0157 1242.7795 1266.4324 1270.3611 1283.7818 1324.4893 1336.9875 1347.0243 1348.9769 1379.4899 1380.2244 1382.8688 1387.7424 1397.8548 1426.6585 1448.9340 1455.3823 1456.5612 1464.7937 1467.8588 1470.0842 1471.1294 1471.9342 1472.3880 1483.6395 1486.4606 1487.1306 1568.5264 1586.3994 1608.0550 2978.4289 2986.1043 2989.3213 2990.2394 2991.3113 2994.4432 3032.8844 3047.5447 3067.4795 3077.7796 3085.2430 3085.4552 3089.0962 3094.5599 3100.4768 3105.3841 3114.7062 3139.3676 3155.7770 3171.2385 3179.0465 3309.8434
redmass: 2.5272 4.3463 3.0527 2.6908 3.7571 3.1907 3.6761 3.6894 4.8135 4.9940 4.6377 3.8973 2.4122 4.5760 3.0894 2.8886 1.1389 2.0017 1.2135 1.6064 1.8503 3.4278 5.0109 7.4073 3.2750 5.7441 4.3392 3.4596 5.3270 3.5903 3.5686 4.1241 3.1938 5.1189 4.5342 4.8497 6.7166 6.3833 6.2442 5.0868 1.9128 2.7804 1.7034 1.4678 2.4735 5.3149 1.1263 1.6083 6.1957 3.2993 1.4773 2.7566 1.2262 2.4221 1.3500 1.3854 1.3394 3.0329 3.0627 3.6306 6.3148 2.3386 2.1510 1.7184 2.8579 2.1908 1.6757 1.6200 2.0638 1.0756 1.9550 3.3336 3.0109 1.1200 1.4671 1.1163 1.5338 1.3676 1.2275 1.2548 2.4365 2.0785 1.2253 1.2296 1.2315 2.2205 1.1887 1.0508 1.0532 1.0521 1.0953 1.5343 1.1091 1.3257 1.0468 1.0729 1.0514 1.0589 7.2851 7.9869 6.8835 1.0352 1.0487 1.0627 1.0357 1.0504 1.0360 1.0866 1.1013 1.1021 1.0990 1.0965 1.0993 1.1021 1.0987 1.1008 1.1005 1.1022 1.0864 1.0911 1.0948 1.0998 1.0813
irintensity: 1.2004 1.1918 0.1310 0.1378 0.4143 1.1361 3.0553 2.0459 0.8090 0.1465 4.8891 2.0742 1.1332 2.1958 6.5168 0.6759 0.2602 2.3342 1.0720 1.8469 5.8887 9.9552 12.4670 17.5417 0.6676 5.2838 19.6682 5.6224 8.0518 11.3750 11.2217 5.8453 2.8108 53.3405 2.7047 4.7439 21.7321 101.7041 41.7265 20.9186 86.3637 20.0851 119.9447 113.4071 16.7821 62.0661 5.9291 15.4181 126.0050 140.1398 2.9480 19.4451 2.4653 32.2840 0.0942 2.4590 1.4161 106.8921 101.6676 289.8209 42.0547 24.1419 12.6327 108.1246 123.1233 50.4726 21.7884 22.8280 11.7227 9.2381 37.3858 103.8298 371.2146 0.1409 19.6374 10.2152 13.2326 3.6076 8.1076 8.3883 18.9065 20.2955 25.7354 26.2575 17.7057 19.9588 95.4942 6.0997 4.5801 2.9125 34.3148 56.4923 16.3341 43.7530 7.3082 11.7493 10.7238 15.8578 57.9054 115.9701 172.8746 24.7421 27.4133 35.3256 16.1435 33.1603 23.7852 4.7616 2.1575 14.8206 51.8907 25.6105 6.8987 41.8291 50.9964 14.7189 33.8964 30.3171 3.2814 14.5927 3.9957 11.9114 463.5605
temp: 298.150 k
press: 1.00000 atm
elementType: 15 8 8 8 8 8 7 6 6 6 6 6 6 6 6 6 6 6 6 6 6 1 1 1 1 1 1 1 1 1 1 1 1 1 1 1 1 1 1 1 1 1 1
symmnumber: 1
zpe: 905212.2 jmol-1
zpe.correction: 0.344777 hartree
zpe.thermalcorrener: 0.368451 hartree
zpe.thermalcorrenthalpy: 0.369395 hartree
zpe.thermalcorrgfe: 0.289205 hartree
zpe.sumelectzpe: -1317.165093 hartree
zpe.sumelectthermal: -1317.141420 hartree
zpe.sumelectthermalent: -1317.140476 hartree
zpe.sumelectthermalfe: -1317.220665 hartree
dipole: -5.8674 -3.2071 -1.2388
dipole: 6.8005
quadrupole: -134.9319 -117.9757 -129.9497
quadrupole: -7.9613 0.0569 -1.9859
quadrupole: -7.3128 9.6434 -2.3306 -7.9613 0.0569 -1.9859
hfenergy: -1317.5098705 hartree
pointgroup: C01 [X(C14H22N1O5P1)]
dipole: 2.0902176 1.2530788 -1.1041365 debye
polarizability: 226.2853381|-3.9890069|227.1967288|-9.8115583|-18.3528392|160.3076631 unknown
InChI: InChI=1S/C14H22NO5P/c1-5-15-21(17,18-6-2)20-13-10-8-7-9-12(13)14(16)19-11(3)4/h7-11,15H,5-6H2,1-4H3
charge 0 multiplicity 1
43 atoms
P  -2.664267 -0.452455 0.240166
O  -1.037998 -0.402585 0.970912
O  -3.413813 0.728947 1.249314
O  2.663301 0.836211 -0.455286
O  -3.469333 -1.817937 0.288376
O  0.42553 1.155288 -0.986766
N  -2.256558 0.163818 -1.297669
C  -0.056755 -1.36116 0.666783
C  1.165604 -0.943066 0.062709
C  -3.097055 -0.015017 -2.49864
C  2.99987 2.177167 -1.070332
C  -0.238676 -2.703676 1.07104
C  1.336115 0.428825 -0.493269
C  2.220484 -1.888603 -0.061816
C  -2.987211 2.158294 1.213288
C  -3.811921 1.279655 -2.938216
C  4.253879 2.647868 -0.33189
C  3.190872 1.991874 -2.582035
C  0.806906 -3.633786 0.899283
C  2.045042 -3.224526 0.346581
C  -1.94746 2.455958 2.296057
H  -1.333442 0.630322 -1.363555
H  -2.454527 -0.392183 -3.317751
H  -3.836702 -0.808824 -2.285403
H  2.139245 2.842812 -0.87444
H  -1.193848 -2.994521 1.518681
H  3.167473 -1.557681 -0.497447
H  -2.60971 2.408029 0.201575
H  -3.92758 2.708584 1.388934
H  -4.409535 1.099168 -3.851543
H  -3.08152 2.079572 -3.157894
H  -4.490825 1.638565 -2.14419
H  4.556802 3.643139 -0.704394
H  4.066478 2.722897 0.752543
H  5.090674 1.945947 -0.493766
H  3.459242 2.958873 -3.045516
H  2.262805 1.630706 -3.055895
H  4.003905 1.273116 -2.787137
H  0.659396 -4.673899 1.209322
H  2.862356 -3.943526 0.231383
H  -1.715243 3.538408 2.301807
H  -2.335576 2.177752 3.290715
H  -1.018826 1.891748 2.11078
