program: Gaussian 09
title: 000180711
version: EM64L-G09RevD.01
frameworkgroup: C1[X(C16H24N4O4)]
method: RPBEPBE
basis: SDD
operation: Freq
keyword: #p
keyword: freq=noraman
keyword: PBEPBE/SDD
title: #p freq=noraman PBEPBE/SDD
converged: YES YES NO NO
title: Mulliken charges:
elementType: O O O O N N N N C C C C C C C C C C C C C C C C H H H H H H H H H H H H H H H H H H H H H H H H
charge: -0.451775 -0.293983 -0.194124 -0.323676 -0.374582 -0.362190 -0.317754 -0.053514 -0.398248 -0.150621 -0.515188 -0.360857 -0.542617 -0.339938 0.506773 0.196982 0.157507 -0.336172 -0.695847 -0.547955 0.160536 -0.326077 0.290390 -0.762820 0.216013 0.263784 0.300823 0.231945 0.247119 0.198837 0.208297 0.199693 0.199754 0.192452 0.197042 0.348910 0.233917 0.209221 0.212605 0.215306 0.244079 0.388046 0.247183 0.338851 0.259871 0.262668 0.220773 0.398559
chargesum: 0.00000
title: Mulliken charges with hydrogens summed into heavy atoms:
elementType: O O O O N N N N C C C C C C C C C C C C C C C C
charge: -0.053215 -0.293983 -0.194124 -0.323676 -0.025672 0.025856 0.021097 -0.053514 0.081550 0.150203 -0.036124 0.046278 -0.143170 0.049556 0.506773 0.196982 0.157507 -0.102255 -0.058716 -0.303877 0.160536 -0.078894 0.290390 -0.019508
polarizability: 3.33696599e+02 -1.49494234e+01 2.06272491e+02 1.93572422e+00 -2.10117492e+01 1.60853244e+02
1716.lowfreq: -4.1864 -0.0006 -0.0004 0.0009 3.1686 3.6840 12.9683 14.3613 28.3500
frequency: 10.2633 14.1105 28.2939 35.7720 38.3814 49.2213 58.9351 64.5560 67.2109 71.5949 104.8087 105.9329 111.3959 118.6426 147.4120 160.0605 173.2800 199.3526 221.2761 228.8847 241.8414 255.4323 269.6451 293.3305 333.7529 350.1280 362.3618 373.2593 404.0612 410.7394 431.6030 482.8061 517.0000 525.8794 540.8320 557.6780 578.2213 594.0387 602.6257 611.3787 618.3836 647.0951 655.3010 686.7319 703.9385 728.3500 748.3538 780.5800 784.2899 809.7098 818.0620 840.7304 847.0320 861.1001 894.1201 917.3747 920.3795 933.1362 942.0880 960.5917 961.4601 992.3825 999.4532 1007.5502 1013.6013 1046.1132 1069.5819 1070.1832 1075.7303 1079.4094 1100.7904 1105.8897 1136.6570 1155.5441 1187.8686 1204.6095 1206.3859 1230.9345 1257.4430 1262.7464 1267.4080 1273.7262 1276.0246 1288.2517 1288.9809 1303.5756 1320.9525 1323.1441 1327.9001 1336.2890 1344.1729 1345.5781 1348.2964 1388.7911 1391.9148 1394.6690 1427.3862 1449.3779 1455.6040 1457.6811 1464.0411 1468.0901 1468.6273 1477.6069 1479.0725 1487.4939 1493.2235 1501.2054 1547.4401 1573.1565 1589.8596 1613.3975 1623.1070 1684.3201 2962.1328 2964.1103 2972.8161 2974.4562 2996.7206 3000.9719 3002.8067 3016.5494 3019.1297 3038.3411 3043.0261 3067.0444 3069.8963 3071.1342 3083.9212 3101.2545 3108.1388 3109.0620 3121.9297 3163.9300 3180.2597 3493.0460 3531.4934 3535.5018
redmass: 4.0686 3.9966 4.5099 4.7820 7.8514 3.5913 2.5986 3.3099 1.5943 2.8694 2.5712 4.5347 3.3938 4.9827 4.8141 4.4747 4.8443 3.9178 3.8814 1.1561 5.5861 3.8067 3.9466 5.4611 3.4297 3.4193 4.6086 2.9860 3.2650 2.8517 3.5114 3.5396 2.9475 2.5179 3.2986 2.5483 2.6205 3.3189 2.0374 3.0894 2.6046 4.8140 1.2160 3.6770 3.8318 1.0781 4.2637 3.9593 1.2046 2.4508 1.5549 4.9727 1.4631 2.6751 1.6972 1.3001 2.4265 1.4472 3.8149 1.6835 1.9167 3.5910 2.9544 1.5989 3.6119 1.6461 2.5859 3.0708 1.6666 1.6863 2.9343 2.1964 2.2759 1.4054 1.5973 1.4185 1.4982 2.0809 1.4056 1.5486 1.7336 1.6345 1.2955 1.1298 1.5231 1.8342 1.3836 1.5275 1.4816 1.5086 1.5032 2.6541 2.1902 1.2220 2.5407 1.2261 1.7631 1.0456 1.1017 1.1071 1.0755 1.1134 1.0769 1.0425 1.0718 1.0909 2.7011 2.0931 4.1573 2.4351 6.4840 4.0433 4.2291 9.3923 1.0583 1.0599 1.0378 1.0591 1.0605 1.0976 1.0361 1.1010 1.0611 1.0840 1.1042 1.1016 1.1003 1.0997 1.1025 1.0978 1.0914 1.1015 1.0901 1.0957 1.0918 1.0762 1.0646 1.0777
irintensity: 0.1059 1.2841 0.5527 0.2738 2.1090 0.0676 0.1557 0.5309 0.4359 0.8356 1.5681 8.5006 1.6337 1.4132 0.8489 7.5456 0.9435 2.5840 5.1708 0.7129 12.4473 5.5492 0.2382 4.0067 3.6115 0.4527 8.5651 1.2786 1.4644 4.0157 1.2404 20.1977 68.3517 42.3458 19.7777 56.5984 37.2523 2.1832 86.4167 47.5630 41.0203 9.3558 61.1376 50.5471 28.8743 8.0742 0.3706 7.7268 1.4686 4.1577 14.4605 5.1705 226.0446 23.5146 9.0272 4.2716 14.3533 6.4126 32.4686 3.8586 11.2467 10.5171 22.4470 2.5322 0.6658 13.6939 1.0755 76.1103 74.2942 76.2754 28.6565 20.4520 15.2475 33.0334 11.1468 9.5217 3.1404 0.7386 1.6303 7.0598 1.9985 61.2634 2.7687 1.2647 2.8945 38.0980 4.8221 3.2287 44.0487 4.8848 3.2612 5.6668 3.9502 10.4577 129.7046 61.6321 22.6716 16.7524 17.4239 72.1598 0.1517 50.0848 0.2385 12.3528 5.9417 9.7019 613.2242 270.3111 121.7137 103.8270 211.8524 369.6945 43.7090 221.4477 17.0046 6.3940 37.2241 109.4595 33.7623 5.1490 8.1497 0.9482 16.7667 5.8860 45.1868 13.7083 79.4948 65.0015 13.7562 4.5704 42.5770 21.3623 22.1090 52.9670 647.2447 100.6062 38.0131 78.3889
temp: 298.150 k
press: 1.00000 atm
elementType: 8 8 8 8 7 7 7 7 6 6 6 6 6 6 6 6 6 6 6 6 6 6 6 6 1 1 1 1 1 1 1 1 1 1 1 1 1 1 1 1 1 1 1 1 1 1 1 1
symmnumber: 1
zpe: 1029480.6 jmol-1
zpe.correction: 0.392108 hartree
zpe.thermalcorrener: 0.418040 hartree
zpe.thermalcorrenthalpy: 0.418984 hartree
zpe.thermalcorrgfe: 0.330972 hartree
zpe.sumelectzpe: -1142.197161 hartree
zpe.sumelectthermal: -1142.171230 hartree
zpe.sumelectthermalent: -1142.170285 hartree
zpe.sumelectthermalfe: -1142.258297 hartree
dipole: 4.7002 8.6459 -2.6215
dipole: 10.1841
quadrupole: -101.2653 -152.2813 -145.3635
quadrupole: 21.3469 -3.8948 -0.5024
quadrupole: 31.7047 -19.3113 -12.3935 21.3469 -3.8948 -0.5024
hfenergy: -1142.5892695 hartree
pointgroup: C01 [X(C16H24N4O4)]
dipole: -1.8364424 -2.6572363 -2.3707519 debye
polarizability: 330.5332256|-26.7924332|189.0056296|9.2245634|28.8797805|181.2834789 unknown
InChI: InChI=1S/C16H24N4O4/c1-3-4-5-12-6-8-14(17-10-12)19-20-15(22)9-7-13(16(23)24)18-11(2)21/h6,8,10,13,18-20,23H,3-5,7,9H2,1-2H3
charge 0 multiplicity 1
48 atoms
O  -6.100182 -1.632021 0.05656
O  -2.130899 3.310602 0.658307
O  -5.364706 -0.552191 1.982667
O  -1.625668 -0.935708 -1.487888
N  -3.942518 -1.103079 -1.325491
N  -1.066572 1.392503 -0.109529
N  -0.051001 1.552119 0.8458
N  2.164543 1.635226 1.528523
C  -4.409841 1.228603 -0.426514
C  -4.091703 -0.271696 -0.115152
C  -3.232675 1.977381 -1.105314
C  5.724975 -1.37406 0.668797
C  5.438744 0.093276 0.243874
C  7.220087 -1.747362 0.554234
C  3.970761 0.472141 0.328931
C  -2.102953 2.302048 -0.123895
C  -5.203936 -0.819033 0.778708
C  3.017782 0.023724 -0.625929
C  7.50862 -3.205304 0.973026
C  3.468776 1.277828 1.381581
C  1.270553 1.183844 0.594341
C  1.658977 0.367968 -0.510195
C  -2.73377 -1.419509 -1.900003
C  -2.776446 -2.39196 -3.06866
H  -5.303211 1.267403 -1.078879
H  -4.661889 1.738426 0.52183
H  -3.14984 -0.321185 0.46171
H  -2.860187 1.404741 -1.973222
H  -3.607141 2.947366 -1.476093
H  5.122102 -2.061612 0.040805
H  5.380595 -1.524501 1.711612
H  6.034992 0.77172 0.886185
H  5.808818 0.236699 -0.792241
H  7.556517 -1.585879 -0.490693
H  7.817496 -1.055364 1.182606
H  -4.795513 -1.553714 -1.666396
H  3.344604 -0.595273 -1.470839
H  6.946375 -3.918037 0.340381
H  7.208555 -3.381827 2.023073
H  8.583508 -3.448284 0.883069
H  4.150293 1.667482 2.149279
H  -1.152292 0.475869 -0.598763
H  0.929101 0.020499 -1.246503
H  -0.23354 2.306128 1.518326
H  -2.320576 -1.916323 -3.953622
H  -2.161424 -3.274193 -2.821055
H  -3.79543 -2.726211 -3.3253
H  -6.835155 -1.936674 0.653252
