program: Gaussian 09
title: 000180653
version: EM64L-G09RevD.01
frameworkgroup: C1[X(C14H20N2O)]
method: RPBEPBE
basis: SDD
operation: Freq
keyword: #p
keyword: freq=noraman
keyword: PBEPBE/SDD
title: #p freq=noraman PBEPBE/SDD
converged: YES YES NO NO
title: Mulliken charges:
elementType: O N N C C C C C C C C C C C C C C H H H H H H H H H H H H H H H H H H H H
charge: -0.294874 -0.381776 -0.701895 0.282763 -0.515325 -0.114556 -0.244781 -0.384175 -0.219170 -0.252720 -0.371207 0.427138 -0.223854 -0.466700 -0.224592 -0.211133 -0.695372 0.248100 0.217563 0.281085 0.227002 0.242125 0.206588 0.238644 0.224776 0.213345 0.214786 0.186199 0.219374 0.215856 0.206544 0.207567 0.199009 0.227080 0.221706 0.296984 0.297895
chargesum: 0.00000
title: Mulliken charges with hydrogens summed into heavy atoms:
elementType: O N N C C C C C C C C C C C C C C
charge: -0.294874 -0.100692 -0.107017 0.282763 -0.049663 0.112446 -0.002655 -0.177587 0.019474 -0.027944 -0.157862 0.427138 0.177131 -0.031470 -0.018047 -0.003566 -0.047576
polarizability: 1.98261177e+02 8.59771133e-01 1.82909634e+02 3.18235780e+00 -4.48600710e+00 1.26372901e+02
1716.lowfreq: -12.0654 -0.0005 -0.0003 0.0002 3.9153 5.0357 29.9200 42.6676 46.7365
frequency: 29.6898 42.5259 46.4460 60.0551 89.7117 92.8465 135.1662 168.4017 190.7465 209.3837 239.8780 243.5254 266.8554 277.5233 293.9706 335.5880 345.3805 363.8399 378.7623 397.0377 423.8524 460.2227 473.7692 515.4879 553.1993 565.2554 584.7267 589.4522 627.3290 691.7062 717.2801 723.6656 739.8747 769.0795 781.5844 820.4734 847.1408 873.3813 880.9442 907.8935 926.1616 936.0172 949.7703 958.0015 964.7895 978.1359 982.5888 984.7651 996.1780 1034.6436 1042.5081 1079.9060 1083.7559 1099.6338 1111.8988 1138.4492 1161.4821 1166.4915 1173.4426 1204.0333 1207.3811 1239.7391 1256.7254 1259.5339 1285.8483 1307.5932 1319.4398 1336.9076 1340.7315 1354.1132 1360.8887 1386.6409 1396.0584 1421.6552 1431.5352 1445.6612 1457.2634 1458.1499 1479.4433 1489.2996 1608.4912 1636.4704 1654.5775 1676.5462 1690.1266 2937.0274 2941.5241 2958.9688 2960.0073 2964.9581 2984.1681 3006.2438 3044.3129 3080.6489 3091.0664 3093.7090 3097.7987 3097.9113 3119.2894 3124.5395 3132.8559 3147.6403 3523.4309 3563.5816 3703.2990
redmass: 3.6203 3.5203 3.4784 3.0891 2.9402 2.9890 3.2586 2.1163 3.0114 3.6795 1.3991 1.4680 2.4289 1.8259 2.5088 2.9690 2.1981 2.6431 1.4496 1.5692 2.8249 3.8812 2.7333 1.9436 4.0647 6.5589 5.1806 4.6374 2.6123 2.4066 2.3243 1.2766 1.5155 1.9956 3.0050 1.1237 3.6808 3.0524 2.6904 2.6986 3.1970 2.7405 1.8302 1.3759 1.8733 1.3724 1.8612 1.5708 3.0338 3.0796 2.9335 1.4675 1.5692 2.3384 2.0706 1.5254 1.1403 1.2613 1.0979 1.1531 1.4673 1.6163 1.3951 1.7726 1.3951 1.5984 1.5266 1.6217 1.5764 1.3060 2.1022 1.2475 1.5036 2.0946 1.4096 1.0890 1.0989 1.0423 1.0491 1.0850 5.9649 1.2128 7.0996 6.2382 6.6784 1.0609 1.0582 1.0809 1.0675 1.0957 1.0356 1.1027 1.0910 1.0988 1.1009 1.0837 1.0863 1.0857 1.0914 1.0980 1.0991 1.0964 1.0766 1.0449 1.1035
irintensity: 0.0669 0.4418 0.6222 0.3099 3.7582 0.1012 1.3280 11.4828 3.7773 8.3672 128.7047 5.0553 23.9401 41.0064 34.0426 1.6639 24.1249 44.7646 46.5411 41.0097 1.6266 13.2182 6.8309 8.8148 6.0659 0.1846 0.6994 2.3638 31.9928 55.9884 20.9917 2.9048 9.3496 80.7937 12.9972 2.0424 10.4567 3.5532 23.3252 27.2353 21.3206 5.0664 17.4873 2.4343 15.5403 1.0390 10.4915 22.3947 91.0092 96.8928 13.2708 17.9123 12.9952 55.7827 36.7207 0.1828 5.6500 15.0547 0.0095 52.2916 82.7543 8.8692 26.9110 15.2085 7.7671 4.9761 6.7739 2.7347 0.6314 4.1664 2.3753 20.9467 4.1718 36.6940 78.1017 10.5082 13.5089 9.4750 3.6031 4.5224 13.5673 103.6855 5.5230 112.7322 0.1092 56.5594 70.5863 7.2257 26.9372 26.0558 35.9767 21.1752 34.0235 42.4292 46.7131 8.7675 26.7236 11.7905 30.9259 62.9559 16.6504 14.3658 4.4964 40.1377 16.8045
temp: 298.150 k
press: 1.00000 atm
elementType: 8 7 7 6 6 6 6 6 6 6 6 6 6 6 6 6 6 1 1 1 1 1 1 1 1 1 1 1 1 1 1 1 1 1 1 1 1
symmnumber: 1
zpe: 818246.3 jmol-1
zpe.correction: 0.311654 hartree
zpe.thermalcorrener: 0.329437 hartree
zpe.thermalcorrenthalpy: 0.330382 hartree
zpe.thermalcorrgfe: 0.265598 hartree
zpe.sumelectzpe: -728.839498 hartree
zpe.sumelectthermal: -728.821714 hartree
zpe.sumelectthermalent: -728.820770 hartree
zpe.sumelectthermalfe: -728.885553 hartree
dipole: -0.7450 -2.3454 -2.1141
dipole: 3.2442
quadrupole: -93.3569 -92.1312 -100.4639
quadrupole: 7.0011 4.4807 -3.1443
quadrupole: 1.9604 3.1861 -5.1465 7.0011 4.4807 -3.1443
hfenergy: -729.1511514 hartree
pointgroup: C01 [X(C14H20N2O1)]
dipole: -0.1572138 -0.8575817 -0.9321915 debye
polarizability: 197.1152997|1.5093568|183.4011374|8.972298|1.3440065|127.0272754 unknown
InChI: InChI=1S/C14H20N2O/c1-2-17-14(10-8-12(15)9-11-14)16-13-6-4-3-5-7-13/h4-10,13,16H,2-3,11,15H2,1H3
charge 0 multiplicity 1
37 atoms
O  -0.819341 2.039075 0.781583
N  0.301962 0.291376 -0.456622
N  -3.593681 -2.564899 -0.925183
C  -0.984104 0.710251 0.112365
C  -1.550844 -0.165451 1.263723
C  1.452994 -0.051685 0.420878
C  -1.984447 0.772204 -1.040767
C  -2.208533 -1.4436 0.777741
C  1.586684 -1.556934 0.6163
C  2.728018 0.561759 -0.137553
C  -2.831571 -0.265107 -1.290867
C  -2.856134 -1.473896 -0.436364
C  -0.316729 3.128712 -0.075146
C  4.003925 -1.622647 -0.131956
C  2.717966 -2.26105 0.350132
C  3.864457 -0.136945 -0.39086
C  0.406768 4.128942 0.830178
H  -2.282547 0.463889 1.813701
H  -0.740629 -0.385472 1.981627
H  0.246072 -0.244175 -1.326573
H  1.230632 0.438336 1.392833
H  -1.969776 1.658715 -1.684578
H  -2.247414 -2.304853 1.45685
H  0.678573 -2.078701 0.947149
H  2.676192 1.637039 -0.35325
H  -3.52727 -0.21827 -2.140655
H  0.36738 2.704016 -0.837394
H  -1.171429 3.618631 -0.588748
H  4.81286 -1.800789 0.610904
H  4.354419 -2.133928 -1.055224
H  2.723381 -3.352034 0.483506
H  4.74007 0.381189 -0.806102
H  0.747001 5.005218 0.246791
H  -0.265859 4.483544 1.630942
H  1.285771 3.658478 1.305349
H  -3.668735 -3.41859 -0.379398
H  -3.891577 -2.593748 -1.895608
