program: Gaussian 09
title: 000180614
version: EM64L-G09RevD.01
frameworkgroup: C1[X(C9H18N4OS)]
method: RPBEPBE
basis: SDD
operation: Freq
keyword: #p
keyword: freq=noraman
keyword: PBEPBE/SDD
title: #p freq=noraman PBEPBE/SDD
converged: YES YES NO NO
title: Mulliken charges:
elementType: S O N N N N C C C C C C C C C H H H H H H H H H H H H H H H H H H
charge: 0.205475 -0.209706 -0.407252 -0.180239 -0.012707 -0.292527 0.303231 -0.208108 -0.744850 -0.741652 -0.759796 0.258295 -0.179561 -0.589245 -0.809001 0.235428 0.198100 0.204996 0.278150 0.199597 0.222369 0.260736 0.205429 0.230267 0.219189 0.306091 0.305308 0.253777 0.221987 0.221074 0.285120 0.279000 0.241025
chargesum: 0.00000
title: Mulliken charges with hydrogens summed into heavy atoms:
elementType: S O N N N N C C C C C C C C C
charge: 0.205475 -0.209706 -0.101161 -0.180239 -0.012707 0.012780 0.303231 0.027321 -0.063604 -0.058949 -0.104911 0.258295 -0.179561 0.107593 -0.003856
polarizability: 1.94197187e+02 5.61670822e+00 1.50125134e+02 3.33293985e+00 -4.73793704e+00 1.03116990e+02
1716.lowfreq: -0.0022 0.0002 0.0010 3.5081 8.1910 11.7837 46.9767 52.4119 58.7569
frequency: 46.8922 52.3914 58.7494 98.1126 102.0019 130.8601 135.6830 148.1121 169.7900 195.5450 205.1962 234.8806 243.9995 254.8691 256.9223 270.8354 290.0163 306.7459 321.1122 357.4280 368.1912 388.9478 415.8555 437.2836 462.1824 506.2006 527.5397 581.8370 594.3962 650.9290 655.0937 660.7974 776.6086 797.6285 898.8336 916.1039 928.3703 931.3889 949.9632 982.8075 987.9142 996.0429 1013.6157 1031.1079 1068.1662 1092.3387 1116.9388 1121.3789 1167.3869 1195.8027 1204.7437 1225.5741 1253.5891 1262.3113 1298.5032 1311.6401 1342.8067 1371.8362 1375.5204 1402.0684 1428.7915 1430.8812 1432.3093 1452.2649 1454.9951 1457.2044 1461.4925 1464.8433 1477.7440 1483.8591 1491.3028 1498.0984 1508.4976 1569.7727 1638.4269 2830.4289 2941.2036 2962.3491 2973.9416 2983.4104 3024.1656 3051.9707 3052.5760 3061.4344 3068.6886 3074.4354 3098.8689 3102.3321 3107.6863 3151.5664 3155.9162 3515.1454 3535.6517
redmass: 3.4184 4.3636 3.6662 3.1608 3.5966 1.3412 2.5379 2.9384 1.1641 2.2018 1.5083 2.1201 3.2477 1.5545 1.2269 1.5364 3.8067 2.1405 2.6730 3.6836 3.1205 3.8457 3.9851 3.0413 3.3925 4.1692 3.7476 7.1254 3.5275 3.9585 2.5955 4.4138 3.3149 6.1713 3.0534 4.4981 1.7255 1.6024 1.2341 1.1932 2.1609 1.3929 1.6179 1.4920 2.9463 5.6777 1.3382 2.8757 2.1572 4.1642 2.5851 2.7525 5.6203 3.5158 1.3642 1.6216 1.1371 1.1961 1.1953 1.2137 1.1514 1.2762 1.0532 1.0585 1.1697 1.0578 1.0482 1.0548 1.0578 1.0567 1.0495 1.0791 1.0614 5.3747 10.3000 1.0790 1.0454 1.0361 1.0375 1.0368 1.0278 1.0878 1.0995 1.0984 1.0989 1.0981 1.1011 1.0991 1.0983 1.1046 1.1059 1.0774 1.0765
irintensity: 0.8478 0.7803 2.7449 1.2966 3.8384 2.7224 1.2095 9.3518 2.3278 0.9187 1.9842 4.6081 13.5441 62.6257 11.5252 30.2461 2.1565 2.2751 12.9991 9.5657 2.3493 2.2680 4.7024 15.2764 0.8000 38.9994 3.1947 4.7922 27.0744 9.1269 82.6292 24.6935 7.0435 10.7468 56.5263 11.1709 1.5909 3.1102 1.3332 7.6641 10.9611 8.4080 3.2066 3.0478 12.6411 37.1857 6.8176 40.5993 87.5673 116.0468 9.1543 16.1650 126.7879 4.9870 28.5775 10.6142 3.5970 24.2295 31.0151 33.0060 5.5797 5.4377 15.7777 21.1463 1.0594 0.1846 9.5015 2.6298 16.5038 3.0059 7.0132 14.1750 32.8001 43.5907 216.3455 59.2881 66.4447 27.4893 44.2089 29.3584 22.6067 27.4413 35.3626 27.5848 9.8922 90.1958 20.4464 5.5642 12.3903 8.3869 9.8905 7.0733 15.6718
temp: 298.150 k
press: 1.00000 atm
elementType: 16 8 7 7 7 7 6 6 6 6 6 6 6 6 6 1 1 1 1 1 1 1 1 1 1 1 1 1 1 1 1 1 1
symmnumber: 1
zpe: 712332.2 jmol-1
zpe.correction: 0.271313 hartree
zpe.thermalcorrener: 0.289396 hartree
zpe.thermalcorrenthalpy: 0.290340 hartree
zpe.thermalcorrgfe: 0.226125 hartree
zpe.sumelectzpe: -1044.781399 hartree
zpe.sumelectthermal: -1044.763316 hartree
zpe.sumelectthermalent: -1044.762372 hartree
zpe.sumelectthermalfe: -1044.826588 hartree
dipole: -1.2269 -2.7938 -0.1846
dipole: 3.0569
quadrupole: -88.5288 -99.2266 -99.3366
quadrupole: -6.2366 0.4603 2.0536
quadrupole: 7.1685 -3.5292 -3.6393 -6.2366 0.4603 2.0536
hfenergy: -1045.0527124 hartree
pointgroup: C01 [X(C9H18N4O1S1)]
dipole: 0.4744916 1.0972377 -0.1319075 debye
polarizability: 194.1429315|5.7646296|150.600454|-3.163592|2.0637963|102.6959255 unknown
InChI: InChI=1S/C9H18N4OS/c1-9(2,3)6-7(14)13(10-4)8(15-5)12-11-6/h6,10-11H,1-5H3
charge 0 multiplicity 1
33 atoms
S  3.461843 0.438925 -0.241876
O  -0.917385 -2.168722 -0.037556
N  -0.365507 1.2371 0.751495
N  1.05836 -0.906047 -0.048306
N  1.011533 1.450965 0.501089
N  1.844578 -2.078384 -0.073311
C  -2.618519 0.30217 0.088425
C  -1.076632 0.32633 -0.182939
C  -3.308574 -0.514784 -1.038334
C  -2.94741 -0.30722 1.476403
C  -3.158326 1.762864 0.026769
C  -0.35958 -1.046149 -0.071332
C  1.662907 0.383669 0.106749
C  2.349433 -2.557349 1.224471
C  3.754856 2.271265 0.064791
H  -0.933434 0.674901 -1.240155
H  -3.12451 -0.061319 -2.031942
H  -4.40174 -0.529085 -0.871674
H  -2.942514 -1.553476 -1.051277
H  -4.029207 -0.207188 1.683466
H  -2.39184 0.210886 2.279246
H  -2.686454 -1.37766 1.507358
H  -2.881988 2.359548 0.917536
H  -4.262507 1.742251 -0.00747
H  -2.804807 2.292291 -0.879361
H  -0.830671 2.132026 0.917915
H  2.473666 -2.114601 -0.879988
H  1.495823 -2.826474 1.869185
H  2.99292 -1.823284 1.755528
H  2.93502 -3.474488 1.03949
H  3.490704 2.514162 1.103143
H  3.137882 2.862895 -0.625857
H  4.828081 2.431081 -0.121579
