program: Gaussian 09
title: 000180585
version: EM64L-G09RevD.01
frameworkgroup: C1[X(C10H12)]
method: RPBEPBE
basis: SDD
operation: Freq
keyword: #p
keyword: freq=noraman
keyword: PBEPBE/SDD
title: #p freq=noraman PBEPBE/SDD
converged: YES YES NO NO
title: Mulliken charges:
elementType: C C C C C C C C C C H H H H H H H H H H H H
charge: -0.008984 -0.168942 -0.288198 -0.255401 -0.527409 -0.565455 -0.221427 -0.243854 -0.285091 -0.198384 0.207739 0.231639 0.237480 0.235978 0.249757 0.221832 0.216226 0.222330 0.233934 0.240960 0.237614 0.227655
chargesum: 0.00000
title: Mulliken charges with hydrogens summed into heavy atoms:
elementType: C C C C C C C C C C
charge: 0.198755 0.062696 -0.050718 -0.019423 -0.055819 -0.126899 0.012507 -0.002894 -0.047477 0.029271
polarizability: 1.07486453e+02 3.79813531e+00 9.76015533e+01 2.39136447e+00 -7.85142259e-01 7.72912242e+01
1716.lowfreq: -29.1709 -26.1922 -0.0004 -0.0002 0.0007 19.4356 195.6830 205.8952 338.8192
frequency: 195.6779 205.8693 338.8029 399.9754 425.0067 441.8294 519.4715 535.2465 636.0166 644.1522 712.4196 733.5974 771.1207 797.4217 824.3178 859.3272 883.1893 893.1325 914.9648 919.9593 924.4569 939.2141 957.4536 980.5568 1000.6016 1059.9974 1070.6932 1076.6263 1083.3767 1105.3596 1115.0957 1124.5546 1153.1049 1171.2345 1200.4771 1210.5125 1236.3246 1249.1140 1258.5227 1290.8173 1304.3079 1316.0268 1385.0200 1423.5484 1455.2407 1488.8751 1553.6825 1568.8949 2910.3596 2953.1853 2966.8386 3015.1824 3049.7531 3074.3124 3088.2897 3091.7487 3136.8115 3148.3755 3171.0572 3181.5404
redmass: 2.8394 2.9606 3.2187 2.9768 2.1810 2.8136 3.1580 2.0568 2.4385 2.3886 1.6009 2.2454 4.8640 3.3124 2.5759 2.6601 2.2807 2.3403 1.6941 1.6006 1.7044 2.3670 2.1274 1.8607 1.5365 1.5919 1.1590 1.8763 1.2562 1.2778 1.4161 2.4144 2.1976 1.3612 1.4376 1.5202 1.5308 1.4874 1.5006 1.5629 1.6971 1.5980 1.1149 1.1286 1.1116 1.0988 5.8405 5.7091 1.0796 1.0697 1.0782 1.0601 1.0968 1.0889 1.0941 1.1032 1.0871 1.0871 1.1059 1.1090
irintensity: 0.0726 0.5736 1.8109 4.1325 4.7490 0.8386 2.3165 6.5667 12.0325 10.6752 68.4343 30.2852 1.9262 20.4805 3.2292 4.9163 11.6295 2.2040 3.4381 0.1377 1.1339 3.0649 0.9734 4.4542 4.2838 2.9910 2.5921 0.5290 2.8088 0.6395 1.9948 1.4569 0.4157 10.0824 0.7285 6.6326 2.8551 3.3720 1.9253 9.5938 0.5931 6.2379 3.1665 1.4427 7.4077 8.7729 3.2394 2.9396 20.0121 17.3873 40.8103 49.2463 39.1977 53.2411 27.2520 41.9663 7.6647 7.6761 42.8642 21.8470
temp: 298.150 k
press: 1.00000 atm
elementType: 6 6 6 6 6 6 6 6 6 6 1 1 1 1 1 1 1 1 1 1 1 1
symmnumber: 1
zpe: 497303.4 jmol-1
zpe.correction: 0.189413 hartree
zpe.thermalcorrener: 0.196592 hartree
zpe.thermalcorrenthalpy: 0.197536 hartree
zpe.thermalcorrgfe: 0.158166 hartree
zpe.sumelectzpe: -387.421322 hartree
zpe.sumelectthermal: -387.414143 hartree
zpe.sumelectthermalent: -387.413199 hartree
zpe.sumelectthermalfe: -387.452569 hartree
dipole: 0.0668 0.1092 -0.0669
dipole: 0.1445
quadrupole: -60.8287 -57.2210 -59.9694
quadrupole: 0.5603 0.5314 0.2451
quadrupole: -1.4890 2.1187 -0.6297 0.5603 0.5314 0.2451
hfenergy: -387.6107353 hartree
pointgroup: C01 [X(C10H12)]
dipole: 0.0252052 0.0435438 -0.0264465 debye
dipolederiv: 0.1515481 -0.0130658 0.0130817 -0.1141967 -0.0850231 -0.0623014 -0.0436019 -0.060166 0.0898628 0.0241594 0.0435625 0.0093511 0.1623334 -0.1548177 -0.0320877 -0.1595178 -0.028752 0.1518173 0.0035952 -0.0617868 -0.0618237 -0.0232253 0.1273627 0.1051856 -0.0124132 0.1212054 0.0258206 0.0281741 0.0863412 -0.0585738 0.0302737 0.1917422 -0.0107136 -0.0393575 -0.0479216 -0.0218901 0.074653 -0.0070139 0.0494462 0.0079087 -0.09324 -0.0346402 0.0431884 -0.0222646 0.0988956 -0.0559159 0.1123778 0.0641115 0.1248736 0.0568527 0.0380591 0.0308848 0.0851611 0.1963719 -0.2002586 0.0396436 0.1792116 0.0860094 -0.0312737 0.0139557 0.224075 -0.0519096 0.0016156 -0.1731767 -0.10732 0.1298497 -0.1357996 -0.0244033 -0.0377098 0.1785376 0.0553356 0.0135324 0.1812453 -0.0719046 0.0354582 -0.1021103 0.0187426 0.0028819 0.1638019 0.0866456 -0.2339707 -0.0760708 -0.0466115 0.0039019 -0.1015736 0.0913354 -0.0570421 -0.0037179 -0.098908 -0.2592798 -0.0100326 -0.0284373 -0.0557929 0.0113099 0.0440893 0.0580579 -0.0466683 0.0047068 -0.1505975 -0.0272008 -0.0472554 -0.007353 -0.0003362 0.0570711 0.0434105 0.0127249 -0.00501 -0.1379454 0.025273 0.0426701 0.0104353 0.0604459 -0.126246 -0.0927082 0.0126175 -0.1026889 0.0228959 0.0308907 -0.0393902 0.0098695 -0.049588 -0.1689705 0.0323234 0.0168374 0.03642 0.0631914 -0.1804193 -0.0187542 0.1009665 -0.0212427 0.0691401 0.0092224 0.0504977 0.0018297 0.0501716 0.0266081 0.0175345 -0.1544724 0.0134758 0.0759565 0.0121925 -0.0937385 0.0237878 -0.1409843 0.0030144 -0.084487 -0.0276276 -0.1080312 -0.1133114 -0.0620481 -0.0523498 -0.1109977 0.0406771 0.0743606 0.0494093 -0.0550007 -0.0041372 0.018724 0.0326398 0.0162247 0.0896489 -0.1427868 0.1333246 0.0352418 -0.0901708 0.0599427 0.0050052 0.0877141 -0.1262786 0.0882605 0.0060449 0.1343607 -0.0046111 -0.0908134 -0.0205665 0.0506199 -0.0720649 -0.1409432 -0.0761866 -0.0324294 0.0110795 0.0763825 -0.0097903 0.1054919 -0.0833667 0.0143352 -0.0332435 0.0010231 0.1807702 -0.1792122 0.0274747 0.0057355 0.0187421 0.0740109 0.0113378 0.0024402 0.0107807 0.1782168 unknown
polarizability: 107.3964539|3.958997|97.7487776|2.0721167|-0.7102301|77.2339991 unknown
InChI: InChI=1S/C10H12/c1-2-9-7-4-5-8(6-7)10(9)3-1/h1-2,4-5,7-10H,3,6H2
charge 0 multiplicity 1
22 atoms
C  0.474145 0.707582 0.384448
C  0.413524 -0.724667 -0.220999
C  -1.048996 1.099347 0.500411
C  -1.052146 -1.193411 0.196126
C  -1.452909 -0.188231 1.333483
C  1.775904 1.246454 -0.264317
C  -1.830239 0.798083 -0.789668
C  -1.882661 -0.558986 -0.949077
C  1.863243 -1.158775 0.01296
C  2.640679 -0.034037 -0.101092
H  0.77702 0.57748 1.44468
H  0.359909 -0.62349 -1.32825
H  -1.253661 2.071861 0.974526
H  -1.21335 -2.264797 0.385628
H  -2.533757 -0.227921 1.549036
H  -0.879961 -0.303729 2.2707
H  2.2152 2.128548 0.234538
H  1.642244 1.487402 -1.341136
H  -2.224018 1.556535 -1.472439
H  -2.29827 -1.11251 -1.796545
H  2.230697 -2.185792 0.099752
H  3.736103 -0.016443 -0.113364
