program: Gaussian 09
title: 000180583
version: EM64L-G09RevD.01
frameworkgroup: C1[X(C12H8Br2)]
method: RPBEPBE
basis: SDD
operation: Freq
keyword: #pfreq=noraman
keyword: PBEPBE/SDD
title: #p freq=noraman PBEPBE/SDD
converged: NO NO NO NO
title: Mulliken charges:
elementType: Br Br C C C C C C C C C C C C H H H H H H H H
charge: 0.030277 0.016441 0.374689 0.254244 -0.399993 -0.302927 -0.351217 -0.351204 -0.197945 -0.169766 -0.218182 -0.218178 -0.195970 -0.235273 0.274260 0.242792 0.242792 0.256571 0.229775 0.229775 0.257897 0.231141
chargesum: 0.00000
title: Mulliken charges with hydrogens summed into heavy atoms:
elementType: Br Br C C C C C C C C C C C C
charge: 0.030277 0.016441 0.374689 0.254244 -0.399993 -0.028667 -0.108424 -0.108412 -0.197945 0.086805 0.011593 0.011597 0.061927 -0.004133
polarizability: 2.22950224e+02 -6.88397804e+00 1.49093991e+02 3.46737403e-03 3.30307767e-03 9.86841798e+01
1716.lowfreq: -37.6758 -2.3783 -0.0003 0.0000 0.0005 6.1511 8.0954 52.3272 68.9988
frequency: -37.6709 52.3195 68.9978 82.2433 127.7040 202.7234 205.5783 228.4693 284.3014 319.1582 366.1493 397.4091 416.1555 455.7221 554.5792 576.4856 612.8710 615.7164 670.0148 703.6394 724.1101 762.4867 777.0215 814.9033 849.7848 893.4815 918.6671 955.6032 972.4198 983.6937 988.2948 996.2671 1021.9421 1050.3658 1078.5083 1079.2641 1136.0449 1173.2212 1187.5187 1242.7812 1270.5068 1310.8624 1343.4869 1369.5354 1370.1154 1428.7869 1436.8667 1486.3442 1546.3977 1581.2547 1584.5599 1612.0506 3125.4935 3131.4128 3142.8377 3152.1560 3159.5943 3165.6293 3166.5655 3179.3059
redmass: 3.8818 7.7071 9.3665 4.2939 12.6709 58.2364 5.2407 6.0211 7.0084 4.6256 4.5992 2.8190 7.5280 3.2977 3.5292 5.0996 7.3721 6.2217 7.1148 1.7323 4.4044 2.4755 3.8474 1.3298 1.2457 1.4204 1.3946 1.3397 1.3872 7.6528 6.4068 1.3192 3.2218 3.2267 1.6013 1.7903 1.4609 1.0532 1.1155 1.5903 1.8024 1.3619 7.7338 7.0758 3.2948 2.1964 2.3913 2.6830 6.7856 7.9180 6.0359 6.2726 1.0846 1.0879 1.0926 1.0970 1.0887 1.0928 1.1018 1.0976
irintensity: 0.0310 0.3761 0.1347 0.6577 0.1904 0.0322 0.1214 0.0058 1.2061 0.6807 1.0813 0.0029 16.3649 16.7965 26.3106 2.9593 4.7368 0.7155 2.9213 49.5966 0.2945 40.4376 8.2238 37.6907 0.0001 13.6520 0.3979 0.0582 0.0507 99.4684 12.5471 0.1442 24.9162 2.8269 8.0214 39.7688 4.7022 0.0153 1.0733 0.4753 8.9725 0.5463 7.3710 0.0044 24.5966 8.6829 95.5769 5.1926 9.9135 12.3475 1.2513 1.5319 1.3809 0.2131 17.5111 34.2743 0.6401 0.4550 21.4207 2.9636
temp: 298.150 k
press: 1.00000 atm
elementType: 35 35 6 6 6 6 6 6 6 6 6 6 6 6 1 1 1 1 1 1 1 1
symmnumber: 1
zpe: 413371.9 jmol-1
zpe.correction: 0.157445 hartree
zpe.thermalcorrener: 0.168924 hartree
zpe.thermalcorrenthalpy: 0.169868 hartree
zpe.thermalcorrgfe: 0.117271 hartree
zpe.sumelectzpe: -488.032825 hartree
zpe.sumelectthermal: -488.021346 hartree
zpe.sumelectthermalent: -488.020402 hartree
zpe.sumelectthermalfe: -488.072999 hartree
dipole: 0.7098 -0.3583 0.0001
dipole: 0.7951
quadrupole: -98.5211 -93.6315 -96.8993
quadrupole: -10.1977 0.0020 0.0012
quadrupole: -2.1705 2.7191 -0.5486 -10.1977 0.0020 0.0012
hfenergy: -488.1902698 hartree
pointgroup: C01 [X(C12H8Br2)]
dipole: -0.3127732 -0.0041032 0.0000241 debye
dipolederiv: -0.2432286 -0.3036056 -0.0002269 -0.298598 -0.5124354 0.0000813 -0.0000552 -0.0002063 -0.0129779 -0.3876163 -0.3192055 0.0000485 -0.4131926 -0.4901479 -0.0000394 -0.0000409 -0.0000774 -0.0313245 0.3244643 -0.2853939 -0.0000036 -0.0813761 -0.1525133 -0.0000085 -0.0000196 0.0000133 -0.0243458 0.2150535 -0.0871876 -0.000015 -0.0915233 -0.0285242 -0.0000505 0.0000261 0.0002702 0.0116693 0.230506 0.6148507 0.0002799 0.5140012 0.8490881 -0.0000968 0.0000876 0.000292 -0.1270736 -0.3232969 -0.0527344 0.0000002 -0.2415143 -0.1804106 -0.0000427 -0.0000408 -0.0001193 -0.0713556 -0.1532333 0.0086147 -0.0772619 0.0090464 -0.1158021 0.0342997 0.0257531 0.0035477 0.0545578 -0.1532337 0.0086518 0.0772218 0.0091023 -0.1157829 -0.0343497 -0.0257399 -0.0036191 0.0545118 0.5724964 0.6026452 -0.0000235 0.724882 0.8450473 0.0001014 0.0000777 0.0001138 -0.1181836 -0.0879807 -0.0841967 -0.0000532 -0.170914 -0.1650257 0.0001381 -0.0000381 -0.00006 -0.0794008 -0.0248573 -0.0174777 0.0899921 -0.006672 -0.1390644 -0.015283 0.0636629 -0.0102071 0.0772439 -0.0248427 -0.0173951 -0.0899707 -0.0066497 -0.1390427 0.0151638 -0.0635858 0.0104879 0.0771849 -0.1294146 -0.2259176 -0.0000401 -0.1160853 -0.2381787 -0.0000259 -0.0000171 -0.000044 -0.1008347 0.0977753 -0.0413336 0.0000053 -0.0426187 -0.1496757 -0.0000201 -0.000027 -0.0000824 -0.057788 0.0942837 0.0315479 0.0000009 0.0570916 -0.0148719 -0.0000238 0.0000103 0.0000234 0.1374267 0.0558968 0.0130855 0.0930475 0.0072969 0.1291532 -0.0194011 0.0911986 -0.0175874 -0.0324105 0.0558744 0.0130037 -0.093026 0.0073425 0.1291496 0.0194837 -0.0912418 0.0173987 -0.0323676 0.0497658 0.0301646 0.0000004 0.0435312 -0.0366975 -0.0000399 0.000012 0.0000163 0.1571582 0.007937 0.0265588 -0.083807 0.0238509 0.1461632 0.0149331 -0.1021734 0.018634 -0.0673426 0.0079681 0.0266853 0.0838134 0.0237798 0.1461032 -0.0148238 0.1021273 -0.0188358 -0.0673248 -0.050497 0.0069112 0.0000123 0.0005367 0.0840194 -0.0000067 0.0000135 0.0000348 0.1647871 -0.1338203 0.0517283 0.0000056 0.0486824 0.1494489 0.000011 0.0000107 0.0000064 0.0881901 unknown
polarizability: 212.8112048|26.3328545|159.2330105|-0.0015477|-0.0045318|98.6841798 unknown
InChI: InChI=1S/C12H8Br2/c13-10-6-7-12(14)11(8-10)9-4-2-1-3-5-9/h1-8H
charge 0 multiplicity 1
22 atoms
Br -0.131342 -2.995205 -0.000282
Br 3.876433 2.392409 0.000161
C  0.424445 -0.105761 -0.00001
C  -1.058054 0.133382 0.000049
C  1.006078 -1.401217 -0.000142
C  1.302565 1.011548 0.000077
C  -1.763571 0.260693 -1.223707
C  -1.763572 0.260053 1.223872
C  2.698708 0.82415 0.000035
C  2.405868 -1.585896 -0.000184
C  -3.155305 0.50675 -1.222883
C  -3.155304 0.506111 1.223177
C  3.266071 -0.466097 -0.000094
C  -3.854654 0.629794 0.000179
H  0.874327 2.01803 0.000182
H  -1.222828 0.162465 -2.17178
H  -1.222828 0.161332 2.171894
H  2.829274 -2.594359 -0.000287
H  -3.691314 0.60203 -2.173791
H  -3.691314 0.600897 2.174134
H  4.350643 -0.606112 -0.000126
H  -4.933725 0.820206 0.000229
