program: Gaussian 09
title: 000180608
version: EM64L-G09RevD.01
frameworkgroup: C1[X(C13H12O6)]
method: RPBEPBE
basis: SDD
operation: Freq
keyword: #pfreq=noraman
keyword: PBEPBE/SDD
title: #p freq=noraman PBEPBE/SDD
converged: YES YES NO NO
title: Mulliken charges:
elementType: O O O O O O C C C C C C C C C C C C C H H H H H H H H H H H H
charge: -0.220115 -0.269073 -0.255658 -0.401639 -0.267112 -0.301362 0.177044 0.071885 0.040684 -0.016190 0.201401 0.034968 0.172315 0.366991 -0.460048 -0.771254 -0.185695 -0.519373 -0.518081 0.264760 0.254968 0.253054 0.240512 0.253141 0.385435 0.231128 0.213858 0.302288 0.213301 0.233759 0.274107
chargesum: 0.00000
title: Mulliken charges with hydrogens summed into heavy atoms:
elementType: O O O O O O C C C C C C C C C C C C C
charge: -0.220115 -0.269073 -0.255658 -0.016204 -0.267112 -0.301362 0.177044 0.071885 0.040684 -0.016190 0.201401 0.034968 0.172315 0.366991 -0.195288 -0.022720 0.067446 0.227901 0.203086
polarizability: 2.41611947e+02 -6.74514593e-03 2.17361686e+02 2.19740186e-01 -4.45294671e+00 8.12521680e+01
1716.lowfreq: -2.0412 0.0003 0.0005 0.0008 4.2084 9.2605 40.2211 51.3749 68.1712
frequency: 40.2008 51.3722 68.1628 95.5460 106.1875 113.6618 125.0527 143.0179 161.6057 175.1956 185.3866 211.3395 230.3098 254.7189 272.2624 286.7309 303.5348 335.5162 344.9064 363.6500 389.8243 400.7842 405.4740 467.4253 476.7396 528.7585 541.8725 563.6042 613.7817 619.7340 625.4220 684.2483 732.7146 789.7791 804.0347 827.0051 864.6863 874.0009 904.8007 955.0939 961.3324 995.7688 1013.5597 1031.3849 1051.3233 1100.6821 1108.0602 1111.4469 1114.7836 1151.6815 1156.3862 1166.9429 1221.3684 1279.5451 1283.3645 1308.8310 1322.9090 1364.9109 1376.4431 1389.8662 1404.3356 1423.7992 1433.4889 1440.3511 1450.4518 1451.5148 1458.1291 1461.6691 1481.5561 1484.4701 1522.7058 1554.6349 1574.4335 1624.8609 1655.5401 2534.6683 2983.1778 2988.7094 2994.4283 3067.7545 3075.4109 3095.2594 3103.6036 3120.5102 3134.4593 3137.5943 3186.8083
redmass: 2.9790 4.3602 2.6635 1.6752 3.1916 4.0494 1.3619 2.4132 1.5937 2.7169 3.4428 5.4557 3.6486 3.8681 6.4960 5.1698 3.9451 5.6458 5.7003 6.4031 5.6259 8.0001 5.7581 7.6514 8.2942 8.2886 4.2776 5.5644 6.5636 7.2383 6.4346 6.6015 5.3223 7.5441 6.8830 5.8638 1.7658 5.0038 8.5532 4.8082 1.7376 2.5630 1.0636 2.7490 1.5301 4.7877 1.7537 1.2683 2.2272 1.4448 1.6304 3.5333 2.4207 3.1535 3.9618 2.1221 3.3224 5.1185 2.7288 4.1487 1.3644 1.4911 1.3988 1.7022 1.0437 1.2145 1.1304 1.0871 1.0547 1.0909 5.4136 7.5078 6.5525 2.9303 6.8941 1.0776 1.0338 1.0306 1.0375 1.0910 1.0974 1.0985 1.1018 1.0994 1.1057 1.1053 1.0932
irintensity: 4.7848 0.3482 7.5421 4.3573 1.1089 0.2642 0.3967 1.3720 0.9488 0.4359 2.5834 12.3243 12.6502 4.5152 0.2002 0.0706 6.6784 3.0975 6.3013 1.0824 10.2577 7.5482 6.9747 3.2350 4.3792 5.7572 0.8084 23.5824 31.7614 0.7546 6.3582 4.7949 6.7413 10.0473 7.0140 9.2373 18.5409 19.5257 0.1808 58.4211 7.0210 9.1194 134.7446 96.5531 11.8850 140.8780 51.9745 3.6522 30.7657 9.6391 0.3716 15.6303 103.0788 167.1206 154.4309 37.6089 385.2071 20.8874 201.1321 91.6871 34.9579 69.9313 38.1370 255.2364 16.2871 31.1582 32.7332 16.8339 24.1666 64.1252 33.2562 250.2403 181.8421 253.3506 212.9620 437.3790 84.8918 60.1571 6.9165 17.0975 7.3654 31.0464 30.1212 10.6103 2.9932 11.5040 2.1820
temp: 298.150 k
press: 1.00000 atm
elementType: 8 8 8 8 8 8 6 6 6 6 6 6 6 6 6 6 6 6 6 1 1 1 1 1 1 1 1 1 1 1 1
symmnumber: 1
zpe: 593904.4 jmol-1
zpe.correction: 0.226206 hartree
zpe.thermalcorrener: 0.244403 hartree
zpe.thermalcorrenthalpy: 0.245347 hartree
zpe.thermalcorrgfe: 0.180114 hartree
zpe.sumelectzpe: -952.498337 hartree
zpe.sumelectthermal: -952.480140 hartree
zpe.sumelectthermalent: -952.479196 hartree
zpe.sumelectthermalfe: -952.544429 hartree
dipole: -3.3242 -1.1336 0.8541
dipole: 3.6145
quadrupole: -108.5983 -104.7331 -110.6831
quadrupole: 8.9310 -2.6420 12.4622
quadrupole: -0.5935 3.2717 -2.6782 8.9310 -2.6420 12.4622
hfenergy: -952.7245432 hartree
pointgroup: C01 [X(C13H12O6)]
dipole: 1.3309527 0.3645766 0.3433869 debye
polarizability: 241.4198303|-1.7346732|217.6073836|3.1264914|-2.0997382|81.1985868 unknown
InChI: InChI=1S/C13H12O6/c1-6-4-8(15)9-11(17-2)7(5-14)10(16)13(18-3)12(9)19-6/h4-5,16H,1-3H3
charge 0 multiplicity 1
31 atoms
O  1.950649 1.191662 0.181995
O  -1.284924 -2.584145 -0.042655
O  -0.038392 2.9256 0.262234
O  -2.74726 1.986998 -0.033199
O  1.640571 -2.884197 -0.55594
O  -4.333598 0.050797 -0.108273
C  0.478981 -0.798895 -0.000599
C  0.670765 0.62712 0.089814
C  -0.874217 -1.260837 -0.024171
C  -0.374756 1.584812 0.081928
C  -1.957458 -0.322267 -0.061034
C  -1.703751 1.09924 -0.021567
C  1.683671 -1.652926 -0.214489
C  3.088959 0.374042 0.138442
C  2.976369 -0.975408 -0.055133
C  4.340916 1.181034 0.300896
C  -3.338458 -0.773726 -0.083426
C  -0.679504 -3.60267 0.84967
C  -0.615516 3.910221 -0.686192
H  3.872757 -1.594154 -0.134771
H  4.334157 1.713928 1.26904
H  4.416802 1.946786 -0.491986
H  5.228102 0.530734 0.257442
H  -3.530888 -1.859369 -0.08079
H  -3.632241 1.418938 -0.07528
H  -1.476409 -4.349223 0.990433
H  -0.404521 -3.146497 1.818363
H  0.208347 -4.03074 0.362625
H  -0.308612 3.667535 -1.721239
H  -0.18023 4.872983 -0.38038
H  -1.71361 3.930826 -0.607159
