program: Gaussian 09
title: 000180577
version: EM64L-G09RevD.01
frameworkgroup: C1[X(C14H11ClN2O2)]
method: RPBEPBE
basis: SDD
operation: Freq
keyword: #p
keyword: freq=noraman
keyword: PBEPBE/SDD
title: #p freq=noraman PBEPBE/SDD
converged: YES YES NO NO
title: Mulliken charges:
elementType: Cl O O N N C C C C C C C C C C C C C C H H H H H H H H H H H
charge: -0.058323 -0.199850 -0.206724 -0.489407 -0.509993 0.504971 0.253088 -0.437534 -0.317440 0.189841 -0.344540 -0.366177 0.283086 -0.183807 -0.198980 -0.120955 -0.220361 -0.229721 -0.222855 0.303895 0.224536 0.311211 0.275399 0.230242 0.309969 0.255801 0.256960 0.237230 0.233759 0.236682
chargesum: 0.00000
title: Mulliken charges with hydrogens summed into heavy atoms:
elementType: Cl O O N N C C C C C C C C C C C C C C
charge: -0.058323 -0.199850 -0.206724 -0.185512 -0.200025 0.504971 0.253088 -0.212998 -0.006229 0.189841 -0.069140 -0.135935 0.283086 0.071994 0.057979 -0.120955 0.016868 0.004037 0.013826
polarizability: 3.27714957e+02 -2.42965008e+00 1.54382602e+02 -9.35114066e+00 1.42492225e+00 9.90999050e+01
1716.lowfreq: -1.9633 -0.0009 -0.0005 0.0017 1.7640 6.5296 22.1050 26.8558 35.2987
frequency: 22.0991 26.8317 35.2958 61.4739 74.5247 86.9812 124.5139 155.6243 176.9570 197.5708 257.3186 271.6345 319.1340 334.4078 371.4522 401.3014 404.9782 411.0593 422.8255 496.3463 506.5475 555.1762 585.4680 594.5632 614.2755 623.6482 668.3176 673.9518 698.0497 702.9845 710.9782 735.5828 793.9987 812.5129 829.2078 845.3471 857.6585 889.3402 935.9069 936.3860 959.8182 979.1651 986.1353 990.4011 993.1588 1008.1237 1025.7692 1074.5910 1080.0953 1097.2499 1117.9925 1155.8083 1175.7770 1186.6978 1190.7312 1238.2011 1262.8594 1296.8440 1317.9779 1364.0911 1386.4307 1401.0989 1415.4661 1437.8020 1479.2466 1479.8554 1500.4719 1584.4710 1595.0988 1607.9770 1609.4859 1623.6822 1676.3723 3118.1791 3120.0650 3134.9856 3147.3779 3159.3124 3166.7220 3171.3314 3172.8208 3197.4004 3522.5492 3529.0416
redmass: 7.5875 4.6337 5.2922 6.7464 7.7081 6.6696 6.8824 6.1339 6.2490 9.5959 6.5426 9.3890 7.8908 5.3556 5.8494 4.6522 3.2396 3.0388 6.5884 4.3020 2.6278 1.2092 7.7876 1.2425 5.9503 7.1018 6.2003 7.4768 3.1561 3.1551 2.1529 6.1531 2.5677 1.4132 5.2620 1.4164 1.2544 6.8227 1.5940 1.3585 5.3719 1.3224 1.6276 3.6378 4.2307 1.3519 2.3623 2.7883 1.8533 2.3473 1.3393 2.4585 1.0614 1.1118 1.1193 3.9669 2.0116 1.3658 1.3237 5.0578 9.2414 4.2484 1.9760 2.1986 2.2829 2.1805 2.2654 6.1198 5.7056 6.2417 5.9947 6.0352 7.7408 1.0879 1.0902 1.0870 1.0916 1.0958 1.0913 1.1012 1.0951 1.0954 1.0770 1.0762
irintensity: 0.1364 0.2797 0.2427 5.4650 3.3712 2.8656 3.5857 0.3612 0.0268 0.0910 8.9679 0.5427 0.2135 1.3272 1.0808 11.0489 0.9099 0.0265 13.8947 17.8153 28.2914 77.2721 3.2374 99.8152 2.2698 0.4036 28.3430 14.1301 9.4388 8.7690 124.2886 14.6770 17.9488 35.7867 11.4425 63.5128 2.0917 12.6230 2.0640 1.0045 1.8132 2.7055 4.6317 0.7228 41.0378 2.5718 13.7011 26.3943 117.5618 18.7459 31.6555 607.9461 0.7566 1.9852 14.7499 172.6214 5.7951 12.6512 2.8024 130.3313 0.8707 7.5008 924.2054 175.4978 49.4173 3.8214 426.0612 20.1589 24.3439 13.2809 12.0145 61.0385 258.5301 12.6299 15.6764 1.3091 17.1790 14.2651 2.3619 22.5180 2.5369 7.9330 6.6150 19.0447
temp: 298.150 k
press: 1.00000 atm
elementType: 17 8 8 7 7 6 6 6 6 6 6 6 6 6 6 6 6 6 6 1 1 1 1 1 1 1 1 1 1 1
symmnumber: 1
zpe: 579955.3 jmol-1
zpe.correction: 0.220893 hartree
zpe.thermalcorrener: 0.237472 hartree
zpe.thermalcorrenthalpy: 0.238416 hartree
zpe.thermalcorrgfe: 0.173639 hartree
zpe.sumelectzpe: -1258.799447 hartree
zpe.sumelectthermal: -1258.782869 hartree
zpe.sumelectthermalent: -1258.781925 hartree
zpe.sumelectthermalfe: -1258.846702 hartree
dipole: 3.6238 -6.6097 -1.1703
dipole: 7.6283
quadrupole: -110.6886 -118.6463 -116.6161
quadrupole: -10.8164 0.7460 1.0949
quadrupole: 4.6284 -3.3293 -1.2991 -10.8164 0.7460 1.0949
hfenergy: -1259.0203407 hartree
pointgroup: C01 [X(C14H11Cl1N2O2)]
dipole: -1.416745 -2.6187425 0.3770501 debye
polarizability: 327.1628124|2.9080727|154.401055|-14.5220109|0.9721573|99.6335966 unknown
InChI: InChI=1S/C14H11ClN2O2/c15-11-6-8-12(9-7-11)16-14(19)17-13(18)10-4-2-1-3-5-10/h1-9,16-17H
charge 0 multiplicity 1
30 atoms
Cl 7.288883 -0.267344 -0.344059
O  -2.135141 2.039677 0.641695
O  0.540316 1.680414 -0.642318
N  1.267637 -0.337058 0.343438
N  -1.02173 0.047482 0.083018
C  2.677861 -0.264536 0.158778
C  -3.482711 0.089273 0.113726
C  3.457631 -1.33702 0.67005
C  3.32025 0.815774 -0.503715
C  -2.184767 0.833181 0.291708
C  -4.622451 0.591834 0.793196
C  -3.615581 -1.052218 -0.720822
C  0.300701 0.572613 -0.108077
C  4.858852 -1.342402 0.522716
C  4.723148 0.806558 -0.656448
C  5.475819 -0.26681 -0.145017
C  -5.869655 -0.051474 0.662484
C  -4.86756 -1.691679 -0.855728
C  -5.99441 -1.198114 -0.158364
H  0.938942 -1.108905 0.928266
H  2.972917 -2.176408 1.184632
H  2.726748 1.650291 -0.880366
H  -4.505684 1.489914 1.408642
H  -2.765458 -1.417126 -1.310695
H  -1.149245 -0.965645 0.024562
H  5.455742 -2.168933 0.918208
H  5.220713 1.636944 -1.165723
H  -6.743595 0.339191 1.194494
H  -4.967295 -2.562617 -1.512432
H  -6.964677 -1.69586 -0.263247
