program: Gaussian 09
title: 000180568
version: EM64L-G09RevD.01
frameworkgroup: C1[X(C8HCl3N2S)]
method: RPBEPBE
basis: SDD
operation: Freq
keyword: #p
keyword: freq=noraman
keyword: PBEPBE/SDD
title: #p freq=noraman PBEPBE/SDD
converged: YES YES NO NO
title: Mulliken charges:
elementType: Cl Cl Cl S N N C C C C C C C C H
charge: 0.097562 0.029635 0.094816 0.142348 0.028863 0.028691 0.727039 -0.498632 0.736649 -0.674386 0.028853 -0.390806 -0.259091 -0.235733 0.144191
chargesum: 0.00000
title: Mulliken charges with hydrogens summed into heavy atoms:
elementType: Cl Cl Cl S N N C C C C C C C C
charge: 0.097562 0.029635 0.094816 0.286539 0.028863 0.028691 0.727039 -0.498632 0.736649 -0.674386 0.028853 -0.390806 -0.259091 -0.235733
polarizability: 1.94854147e+02 1.32927001e+01 2.10082239e+02 2.75465228e-02 -1.87724206e-02 5.02808580e+01
1716.lowfreq: -0.0024 -0.0017 0.0018 3.2318 5.1531 6.0647 61.6396 63.1178 83.9969
frequency: 61.6393 63.1174 83.9962 124.9013 138.0680 139.4815 189.8214 201.7136 236.1135 253.1662 266.8630 308.4897 319.4743 327.9185 354.6755 394.8465 416.4763 470.0101 471.3560 478.7387 626.3032 660.6924 682.7307 687.8252 716.7717 837.5561 861.0057 914.4118 966.4858 1101.5641 1238.6396 1330.3132 1358.2572 1368.2416 1497.2160 1559.9911 2188.5995 2193.7730 2421.8267
redmass: 16.8510 24.7653 20.3671 14.3635 16.0007 14.4939 24.1689 21.1172 18.3221 12.1396 1.1771 26.6184 5.4574 17.0671 25.4942 11.2849 16.1917 11.4103 12.1474 12.3516 11.7515 6.0319 13.6308 11.8753 12.5865 5.7548 11.9122 1.4891 6.7221 12.0130 12.1652 11.0570 11.9507 12.0413 11.5492 11.8431 12.6255 12.6236 1.0369
irintensity: 0.0003 0.6562 2.7867 3.5967 0.4562 1.1664 0.2720 0.7240 2.2081 0.0665 23.2789 0.0841 11.5606 1.0697 0.5675 1.3136 2.9838 0.3116 0.5209 0.9442 0.1423 23.3478 53.1807 0.1941 31.2015 3.4403 11.0298 13.2035 7.4287 9.8556 79.2860 36.8278 77.8289 56.1189 19.5168 115.3958 5.6282 10.2626 2.7460
temp: 298.150 k
press: 1.00000 atm
elementType: 17 17 17 16 7 7 6 6 6 6 6 6 6 6 1
symmnumber: 1
zpe: 170546.0 jmol-1
zpe.correction: 0.064958 hartree
zpe.thermalcorrener: 0.078584 hartree
zpe.thermalcorrenthalpy: 0.079528 hartree
zpe.thermalcorrgfe: 0.023391 hartree
zpe.sumelectzpe: -2192.180913 hartree
zpe.sumelectthermal: -2192.167287 hartree
zpe.sumelectthermalent: -2192.166343 hartree
zpe.sumelectthermalfe: -2192.222480 hartree
dipole: 4.5108 -0.4794 0.0059
dipole: 4.5362
quadrupole: -106.8109 -129.3924 -107.1786
quadrupole: -2.6316 0.0458 0.0118
quadrupole: 7.6497 -14.9317 7.2820 -2.6316 0.0458 0.0118
hfenergy: -2192.2458708 hartree
pointgroup: C01 [X(C8H1Cl3N2S1)]
dipole: -0.4240012 1.724613 -0.1760607 debye
dipolederiv: -0.0290513 0.0320515 -0.0048569 0.0420837 -0.6258016 0.066155 -0.0060176 0.0659488 0.0386373 -0.0771474 0.0101385 -0.003057 0.0222609 -0.6128232 0.0617389 -0.0037185 0.0614782 0.0049681 -0.4774869 -0.3144735 0.0185057 -0.3133885 -0.2214538 0.0181284 0.0183596 0.0179936 0.0385868 -0.3889412 0.4055645 -0.0467167 0.3431633 -0.0404961 0.0099162 -0.0418894 0.0115823 -0.0400575 -0.2023418 -0.0084419 0.0008787 -0.0131486 -0.1820037 -0.0024427 0.001274 -0.002222 -0.2033231 -0.2677303 0.0335826 -0.0046431 0.0410097 -0.1952277 -0.0003709 -0.0054253 -0.000489 -0.2088769 -0.2154834 0.0782057 -0.0186101 0.3203049 -0.3302447 0.0640799 -0.0411017 0.0576729 0.2427672 0.8514403 -0.4760183 0.0692701 -0.3973721 0.1597448 -0.0372653 0.0602368 -0.0387704 -0.1193297 -0.2684532 -0.0885885 -0.0032722 -0.09006 -0.4416508 0.0638306 -0.0029618 0.0638638 0.2292622 0.4369116 -0.0190346 0.015782 -0.0932287 1.0447149 -0.1185089 0.0232357 -0.1167837 -0.1417991 -0.7971911 0.1085544 -0.0292142 -0.1048929 0.8863567 -0.0896459 -0.009355 -0.083418 0.0102109 0.9569163 0.2825136 -0.0030813 0.277581 0.4583011 -0.0454249 -0.0026593 -0.0454669 -0.0715414 0.1233807 0.0957056 -0.0069133 0.0499127 0.0049496 0.0019337 -0.0021617 0.0030561 0.0129014 0.2242909 -0.0870203 0.0133396 -0.0979724 0.0457215 -0.0045812 0.0143189 -0.0044469 0.023384 0.1308869 -0.0527392 0.0025886 0.013747 0.0499129 0.012457 -0.0021347 0.0100012 0.1842098 unknown
polarizability: 216.7177071|-4.9752903|186.8076287|4.4292341|-13.412551|51.6919082 unknown
InChI: InChI=1S/C8HCl3N2S/c9-5-3(1-12)6(10)7(11)8(14)4(5)2-13/h14H
charge 0 multiplicity 1
15 atoms
Cl 0.133294 -3.021261 0.235329
Cl -0.230864 3.357936 -0.395765
Cl 2.618356 1.907237 -0.18572
S  -3.015982 1.489606 -0.27788
N  -3.446764 -2.066624 0.059564
N  3.578875 -1.631627 0.184187
C  -1.247359 -0.627198 -0.029972
C  -1.347485 0.797438 -0.17123
C  1.2240 -0.477343 0.014198
C  0.027126 -1.237068 0.059486
C  -0.149611 1.557696 -0.217512
C  1.110909 0.936685 -0.12672
C  -2.441032 -1.422366 0.019971
C  2.508055 -1.107331 0.106878
H  -2.599116 2.807719 -0.387514
