program: Gaussian 09
title: 000180566
version: EM64L-G09RevD.01
frameworkgroup: C1[X(C9H6BrNOS2)]
method: RPBEPBE
basis: SDD
operation: Freq
keyword: #p
keyword: freq=noraman
keyword: PBEPBE/SDD
title: #p freq=noraman PBEPBE/SDD
converged: YES YES NO NO
title: Mulliken charges:
elementType: Br S S O N C C C C C C C C C H H H H H H
charge: 0.077848 0.382202 0.196004 -0.146920 -0.197956 0.486259 0.337316 -0.856027 -0.576669 -0.324004 -0.325376 -0.211771 -0.202033 -0.229264 0.370524 0.251684 0.260598 0.236234 0.235226 0.236124
chargesum: 0.00000
title: Mulliken charges with hydrogens summed into heavy atoms:
elementType: Br S S O N C C C C C C C C C
charge: 0.077848 0.382202 0.196004 -0.146920 -0.197956 0.486259 0.337316 -0.485503 -0.576669 -0.072320 -0.064777 0.024463 0.033193 0.006860
polarizability: 2.08624870e+02 -1.61883458e+01 1.66340242e+02 3.33191868e+00 3.00633606e+00 9.99656256e+01
1716.lowfreq: -7.3228 -4.9807 -0.0005 0.0019 0.0025 4.7677 30.6555 38.5932 54.5854
frequency: 30.6124 38.5502 54.5834 76.3254 131.6283 149.5954 190.9135 223.0054 262.4704 312.7939 385.5911 398.7918 405.7636 463.9511 490.7435 509.3188 551.9221 562.0033 613.8109 645.0059 695.4743 710.0824 716.5167 766.3219 791.1677 841.9638 915.5211 948.7741 974.6105 990.4354 999.2805 1004.3949 1027.1437 1083.5868 1131.2672 1142.6207 1175.4782 1182.5741 1188.3767 1229.4467 1300.4390 1318.5803 1386.6431 1442.0792 1479.9685 1601.6758 1606.9315 1644.8468 3136.8624 3143.9470 3146.8066 3157.4345 3167.2196 3176.9892
redmass: 7.7126 5.3653 16.4125 7.1934 9.2629 10.1465 29.7535 9.6046 5.9173 11.9824 8.2811 17.2252 2.8108 8.2545 4.3416 16.3547 9.0491 8.1879 6.5495 6.4070 2.0002 5.7058 4.6714 2.3418 4.6116 1.2489 1.6596 3.9688 1.3984 6.2260 1.4121 6.7732 2.1813 1.5460 1.8486 1.6265 1.0528 1.1518 1.2950 7.2550 5.5598 1.4113 10.1483 2.2436 2.3365 6.6266 6.2289 12.3550 1.0854 1.0878 1.0889 1.0933 1.0973 1.1016
irintensity: 0.3037 0.3448 0.4513 1.4934 1.4620 1.0636 2.2401 4.4564 1.2426 0.6605 0.8953 3.6232 0.1651 20.1534 17.0005 12.5071 62.5495 34.8148 0.3295 26.3111 48.0883 20.5542 20.1506 38.0872 22.1190 0.1202 3.9001 0.8797 0.1588 2.6572 1.7759 30.7325 21.3371 9.6136 36.4704 56.8079 0.0197 1.2503 10.9153 387.3415 122.1533 15.7904 3.6279 6.2671 42.0513 3.5399 5.4931 214.2035 0.0341 2.1704 5.2235 21.2234 13.1934 7.9473
temp: 298.150 k
press: 1.00000 atm
elementType: 35 16 16 8 7 6 6 6 6 6 6 6 6 6 1 1 1 1 1 1
symmnumber: 1
zpe: 339277.9 jmol-1
zpe.correction: 0.129224 hartree
zpe.thermalcorrener: 0.142026 hartree
zpe.thermalcorrenthalpy: 0.142971 hartree
zpe.thermalcorrgfe: 0.086771 hartree
zpe.sumelectzpe: -1285.131431 hartree
zpe.sumelectthermal: -1285.118629 hartree
zpe.sumelectthermalent: -1285.117684 hartree
zpe.sumelectthermalfe: -1285.173884 hartree
dipole: -1.8968 -0.3260 0.6857
dipole: 2.0431
quadrupole: -91.5067 -111.8673 -103.3549
quadrupole: 4.7005 1.5593 10.5193
quadrupole: 10.7363 -9.6243 -1.1119 4.7005 1.5593 10.5193
hfenergy: -1285.2606551 hartree
pointgroup: C01 [X(C9H6Br1N1O1S2)]
dipole: 0.7325509 0.0759621 -0.3220467 debye
dipolederiv: -0.304342 -0.2339913 0.056148 -0.3532178 -0.5374118 0.1004153 0.2549953 0.36237 -0.1550397 -0.553813 -0.1823778 -0.0752961 -0.2209351 -0.2902398 -0.0315497 -0.272896 -0.1705476 0.0083694 -0.3928107 -0.2560151 -0.1421696 -0.2133297 -0.5546043 -0.2781251 -0.1342628 -0.3084607 -0.2173217 -0.4643976 0.1894996 0.202242 -0.0414483 -0.8086866 -0.453581 -0.0409637 -0.3722791 -0.548866 -0.8479609 -0.1513542 -0.1141433 0.2029675 -1.1527403 -0.6214536 -0.0211036 -0.5972399 -0.3973698 0.6658412 -0.1250994 -0.0450193 -0.0418131 0.0567495 -0.0968269 0.0150753 -0.0804702 0.0820268 0.8215459 0.2652014 -0.0555656 0.3438381 1.0615013 0.7809914 0.1527343 0.6628662 0.6330322 -0.1145255 0.3152703 -0.0337361 0.4702524 1.0180237 -0.2156533 -0.1947565 -0.3306067 0.2212611 1.2484877 0.174127 0.1280205 -0.0830159 1.0733403 0.7685038 0.2427667 0.759636 0.2510189 -0.06976 0.0911654 -0.042673 -0.0155371 -0.0321028 -0.0270109 0.0463172 -0.023477 -0.0723723 -0.092769 -0.0674615 0.0503306 -0.0007455 -0.0050231 -0.0565464 -0.044115 -0.0026515 -0.0565155 -0.0977189 -0.089575 0.0563648 -0.0577249 0.0368109 -0.111563 0.0475217 -0.106221 -0.0672756 -0.0096408 0.1323541 -0.0762702 0.0930534 -0.0112265 -0.0849854 -0.0666882 -0.0760545 -0.079142 0.1261961 -0.0217657 0.0089219 -0.0163431 -0.0556112 -0.0540114 -0.0052868 -0.0585673 -0.1050769 0.0568691 -0.0445623 0.0468236 -0.0755917 -0.0321418 0.0181099 0.0123918 0.0558216 0.0048627 0.0300595 -0.0728745 0.0519408 -0.0717535 0.0692223 0.0628896 0.05219 0.0314546 0.0941698 0.0810448 0.0553142 -0.0423205 0.061857 0.0241608 0.0713374 -0.0551349 0.0407043 0.0892027 0.0400679 0.0492905 -0.0272694 0.0677518 -0.0022499 0.1059101 -0.0388294 0.1034821 0.0859527 -0.0054733 -0.0588294 0.058288 -0.0802864 0.0336437 0.0897327 0.0588835 0.0822594 0.0915175 -0.1169004 0.0316838 -0.004617 0.032022 0.1085856 0.0334165 -0.0088389 0.0279812 0.1375656 unknown
polarizability: 199.0492425|23.9852252|176.0626206|-1.717029|2.4504867|99.8188738 unknown
InChI: InChI=1S/C9H6BrNOS2/c10-7-8(12)11(9(13)14-7)6-4-2-1-3-5-6/h1-5,7H
charge 0 multiplicity 1
20 atoms
Br -3.579725 -1.85273 0.750773
S  -2.966428 1.276759 0.08754
S  -0.469933 2.671293 1.224355
O  -0.872502 -1.744754 -1.351225
N  -0.51908 0.225793 -0.082071
C  0.922185 0.036285 -0.006212
C  -1.324212 -0.762665 -0.727304
C  -2.81551 -0.465822 -0.543768
C  -1.157083 1.369017 0.429927
C  1.42479 -1.061334 0.725026
C  1.786025 0.927788 -0.677699
C  2.820148 -1.265238 0.7872
C  3.179861 0.717436 -0.606061
C  3.698396 -0.376523 0.125143
H  -3.378774 -0.621104 -1.471792
H  0.736428 -1.744293 1.233241
H  1.37599 1.770053 -1.242741
H  3.218044 -2.115192 1.35106
H  3.857799 1.404962 -1.122347
H  4.78068 -0.53653 0.176556
