program: Gaussian 09
title: 000180647
version: EM64L-G09RevD.01
frameworkgroup: C1[X(C21H19Cl2N3)]
method: RPBEPBE
basis: SDD
operation: Freq
keyword: #p
keyword: freq=noraman
keyword: PBEPBE/SDD
title: #p freq=noraman PBEPBE/SDD
converged: YES YES NO NO
title: Mulliken charges:
elementType: Cl Cl N N N C C C C C C C C C C C C C C C C C C C C C H H H H H H H H H H H H H H H H H H H
charge: -0.055755 -0.041277 -0.173099 -0.128669 -0.099747 -0.204891 0.371341 0.109497 -0.591099 0.244383 -0.426408 -0.377326 0.652748 -0.388275 -0.359212 -0.188177 -0.213591 -0.257155 -0.232358 -0.658765 -0.348646 -0.377175 -0.351654 -0.216878 -0.224803 -0.108299 0.253743 0.229600 0.239305 0.265195 0.219906 0.226231 0.247685 0.233251 0.276113 0.264060 0.225046 0.222681 0.238707 0.219736 0.229677 0.258750 0.251842 0.280940 0.262822
chargesum: 0.00000
title: Mulliken charges with hydrogens summed into heavy atoms:
elementType: Cl Cl N N N C C C C C C C C C C C C C C C C C C C C C
charge: -0.055755 -0.041277 -0.173099 -0.128669 -0.099747 0.048852 0.371341 0.109497 -0.122194 0.244383 -0.161213 0.068811 0.652748 -0.140590 -0.125962 0.087936 0.050468 -0.032109 -0.009676 0.029356 -0.348646 -0.118425 -0.099812 0.064062 0.038020 -0.108299
polarizability: 3.39916460e+02 -2.09182931e+01 2.39861828e+02 -1.50349036e+00 7.83582554e+00 1.97741940e+02
1716.lowfreq: -10.6336 -4.0225 -2.4596 -0.0021 -0.0019 -0.0005 13.2339 18.9894 25.4024
frequency: 12.9562 18.6254 25.1246 32.4239 43.3191 56.5017 57.1965 83.3508 95.3093 102.9610 136.0823 164.9597 171.8087 188.4124 191.1324 200.6919 223.3096 264.6802 270.6635 279.2574 316.7192 336.7277 368.2465 392.9696 403.6001 427.4058 428.7526 442.3169 469.8224 526.3833 545.1502 564.6372 575.9269 581.7408 607.9702 630.6011 640.2326 653.7592 664.8054 691.8340 697.0600 728.5722 737.8455 751.6804 753.9564 767.0062 776.7393 790.5392 796.1357 812.6166 821.3995 844.3419 853.5968 863.0530 867.4656 880.3026 932.8875 936.2855 938.3443 962.6412 976.9000 994.5153 1014.8280 1015.5201 1024.9571 1039.4758 1044.1344 1075.5713 1086.0257 1089.0350 1105.1073 1124.4281 1138.9779 1141.6595 1171.1163 1178.8126 1202.4373 1208.2942 1214.6013 1221.1896 1241.8852 1255.0180 1261.8316 1276.1018 1278.6191 1315.0607 1329.0303 1342.4528 1350.9309 1362.9554 1369.4412 1376.1204 1377.7780 1379.6486 1391.0130 1413.5454 1446.2903 1460.8335 1461.7422 1467.1917 1467.5152 1468.6275 1475.2245 1479.9663 1490.6867 1557.5308 1568.4747 1581.4851 1596.0852 1625.5978 2984.6330 2990.6330 3004.4502 3009.4100 3057.6868 3073.5513 3089.9108 3099.8538 3127.5310 3137.8225 3144.3545 3150.3712 3165.7441 3179.5471 3183.4764 3214.8992 3222.4140 3227.6650 3251.4062
redmass: 5.3787 8.3815 7.7080 7.4564 3.4542 4.2010 4.1405 4.1874 5.4447 5.0177 6.6202 6.1966 4.5547 3.4363 2.6678 2.7093 4.2174 4.7359 2.9149 2.2248 5.8315 4.8235 10.6606 4.8349 5.2992 3.6154 2.9119 3.1559 3.7919 4.4371 4.4745 3.8167 5.3071 3.8189 3.6343 3.9476 4.7805 3.6838 3.8946 5.1031 3.6261 4.3268 1.2995 1.4467 3.0987 3.7615 1.3658 1.7232 1.5479 2.3645 1.4316 1.3995 1.4647 1.4199 3.5187 6.2226 2.4408 1.5515 1.9875 1.4095 1.3055 3.1311 3.2905 2.3214 3.7696 3.4163 1.6373 2.4242 2.3526 2.0225 1.8619 1.6698 1.5252 1.7717 1.1800 1.3359 1.5737 1.8598 2.0146 1.6130 1.8343 2.0053 1.5420 1.4078 1.3517 1.7565 2.7163 1.5015 1.9696 2.7887 4.1025 2.6783 3.1343 2.7864 1.2214 5.2090 2.6354 2.4156 2.3842 4.1545 1.0877 1.1546 2.2463 1.3597 1.1419 5.7096 7.6576 6.9150 7.4012 7.2161 1.0822 1.0355 1.0606 1.0608 1.1029 1.1026 1.0995 1.1020 1.0850 1.0890 1.0904 1.0953 1.1002 1.0954 1.0940 1.0975 1.0912 1.0970 1.1088
irintensity: 0.0340 0.3695 0.7768 0.3192 0.3941 0.5629 1.4053 0.7878 0.5729 0.4598 0.0911 0.1209 1.9528 0.4505 0.6880 0.6178 3.7547 2.7674 0.0882 0.5459 0.7316 0.2774 5.5849 2.8118 11.0157 1.9218 8.7789 3.8575 7.5590 0.3368 13.8403 5.1322 5.0774 1.5925 3.1659 14.8582 1.3827 16.0804 9.6737 17.4242 7.7851 31.4493 16.5375 93.3243 14.3829 10.5901 74.9122 19.0459 4.6175 35.4704 24.9365 1.1997 0.5636 17.6068 6.7907 10.2581 8.0556 3.0592 10.7888 0.9106 0.0141 8.7208 20.8600 11.6886 33.9508 10.0516 34.9487 33.9881 11.3017 10.1886 8.5806 5.1693 16.1977 11.5459 8.8325 15.2693 7.1370 72.6365 2.6664 29.6756 7.2767 17.2575 3.6152 1.2125 2.0116 5.0340 30.2186 30.1850 12.2002 41.8852 4.0888 16.2443 15.5438 3.4089 19.4242 15.2104 26.6811 75.5439 72.9969 7.8128 11.3886 9.3447 6.7735 5.0800 21.6653 27.4702 25.6260 0.2948 36.2826 6.9662 4.0774 23.2987 41.5383 22.2250 4.7980 8.4715 46.6060 28.3714 0.5861 7.0555 4.0158 31.7833 25.0089 0.5702 1.0187 1.4414 4.6443 1.2763 2.6848
temp: 298.150 k
press: 1.00000 atm
elementType: 17 17 7 7 7 6 6 6 6 6 6 6 6 6 6 6 6 6 6 6 6 6 6 6 6 6 1 1 1 1 1 1 1 1 1 1 1 1 1 1 1 1 1 1 1
symmnumber: 1
zpe: 916653.3 jmol-1
zpe.correction: 0.349135 hartree
zpe.thermalcorrener: 0.372557 hartree
zpe.thermalcorrenthalpy: 0.373502 hartree
zpe.thermalcorrgfe: 0.291991 hartree
zpe.sumelectzpe: -1894.176223 hartree
zpe.sumelectthermal: -1894.152800 hartree
zpe.sumelectthermalent: -1894.151856 hartree
zpe.sumelectthermalfe: -1894.233367 hartree
dipole: 4.5629 -4.6981 -3.0141
dipole: 7.2095
quadrupole: -158.4738 -177.7533 -157.8222
quadrupole: -5.3314 -4.4137 2.8637
quadrupole: 6.2093 -13.0702 6.8609 -5.3314 -4.4137 2.8637
hfenergy: -1894.5253578 hartree
pointgroup: C01 [X(C21H19Cl2N3)]
dipole: -1.7795838 -1.3651279 1.7363574 debye
polarizability: 340.0875195|17.2843592|230.695802|-11.0979214|-18.9366584|206.7369072 unknown
InChI: InChI=1S/C21H19Cl2N3/c1-2-25-13-18(17-5-3-4-6-20(17)25)21(26-10-9-24-14-26)11-15-7-8-16(22)12-19(15)23/h3-10,12-14,21H,2,11H2,1H3
charge 0 multiplicity 1
45 atoms
Cl 2.200776 -3.136941 -0.585631
Cl 7.075648 -0.512811 -0.382233
N  -3.2803 -0.915931 1.278034
N  0.502485 1.343483 -0.206545
N  1.495064 3.195025 -1.072292
C  0.165718 -0.092323 0.001279
C  -1.306941 -0.274818 0.296009
C  -2.405504 0.181471 -0.540081
C  1.083568 -0.712073 1.104394
C  -3.625999 -0.241127 0.095611
C  -1.883271 -0.936479 1.383282
C  -4.220886 -1.584256 2.192067
C  2.554606 -0.678035 0.741829
C  -2.477222 0.910778 -1.756952
C  -4.898448 0.032609 -0.455355
C  0.154087 2.412036 0.629937
C  1.314959 1.86546 -1.212613
C  -3.742283 1.185349 -2.309973
C  -4.939504 0.750791 -1.66706
C  -4.641871 -2.988405 1.705326
C  3.182261 -1.698442 -0.013331
C  3.374893 0.414576 1.129914
C  0.769411 3.540695 0.081329
C  4.545802 -1.676012 -0.365061
C  4.744029 0.483869 0.796661
C  5.309534 -0.570384 0.055081
H  0.407813 -0.59087 -0.959063
H  0.916681 -0.160211 2.047256
H  0.758351 -1.756523 1.256245
H  -1.409123 -1.426814 2.231912
H  -3.740671 -1.652496 3.184838
H  -5.110077 -0.937359 2.309305
H  -1.56686 1.265391 -2.251596
H  -5.822977 -0.295329 0.031965
H  -0.514096 2.28531 1.477412
H  1.743466 1.248956 -2.000091
H  -3.81382 1.747396 -3.247477
H  -5.908486 0.98215 -2.123281
H  -5.129398 -2.935022 0.716475
H  -5.353379 -3.442956 2.418484
H  -3.764923 -3.6534 1.618228
H  2.921238 1.234909 1.697022
H  0.725516 4.570142 0.429686
H  4.992968 -2.488229 -0.942762
H  5.351268 1.340549 1.099918
