program: Gaussian 09
title: 000016420
version: EM64L-G09RevD.01
frameworkgroup: C1[X(C9H7N3O2S)]
method: RPBEPBE
basis: SDD
operation: Freq
keyword: #p
keyword: freq=noraman
keyword: PBEPBE/SDD
title: #p freq=noraman PBEPBE/SDD
converged: NO YES NO NO
title: Mulliken charges:
elementType: S O O N N N C C C C C C C C C H H H H H H H
charge: 0.249695 -0.217932 -0.216094 -0.061757 0.022964 -0.560673 0.383130 0.328573 -0.332537 -0.352068 0.382511 -0.377274 -0.369028 -0.691718 -0.210575 0.226227 0.284034 0.284480 0.284647 0.268817 0.340022 0.334554
chargesum: 0.00000
title: Mulliken charges with hydrogens summed into heavy atoms:
elementType: S O O N N N C C C C C C C C C
charge: 0.249695 -0.217932 -0.216094 -0.061757 0.022964 0.113903 0.383130 0.328573 -0.106310 -0.068034 0.382511 -0.092793 -0.084381 -0.422901 -0.210575
polarizability: 3.07452167e+02 -5.75201799e+00 1.51736358e+02 7.81944913e-03 -3.79406532e-03 5.30651539e+01
1716.lowfreq: -5.7491 -5.1761 0.0011 0.0015 0.0016 5.1249 31.0013 50.9610 71.4058
frequency: 30.9367 50.9337 71.4037 96.4024 150.3381 220.4940 237.7875 239.5420 289.0377 313.5754 324.4122 411.2710 419.7011 434.7285 460.3887 479.1642 510.5543 551.8675 570.9429 583.8478 628.1438 652.9244 668.3424 674.1863 718.0552 761.9671 778.7409 801.6676 842.8943 874.9895 881.7605 987.7312 989.1284 1004.4819 1010.1140 1094.8320 1098.4519 1117.3029 1179.4014 1202.3389 1220.5930 1262.2325 1294.5589 1318.7674 1355.7465 1397.0595 1424.0415 1460.2161 1520.8144 1584.3843 1589.0250 1611.7891 1638.6272 3150.6000 3169.2787 3183.9735 3188.0306 3243.2170 3558.0063 3707.3040
redmass: 5.6491 9.4033 6.7830 7.1667 8.7305 7.0749 11.7596 5.0876 2.3089 1.6421 4.1980 2.8850 7.0028 1.2415 8.9296 3.3294 6.9561 7.9420 4.1829 4.6002 7.1066 5.6851 3.2314 9.1374 1.7761 3.2029 8.9959 5.9665 1.3541 7.2625 1.5661 1.3557 2.9486 2.6160 1.3511 3.1197 1.4907 1.4511 1.4533 1.9078 4.2094 3.1266 1.3975 4.1168 8.5483 7.4665 4.4393 3.1772 5.1069 3.7036 2.3030 5.4731 2.6086 1.0894 1.0887 1.0951 1.0969 1.0955 1.0453 1.1046
irintensity: 0.0999 0.0725 0.0051 0.3931 9.3981 4.0595 1.0959 6.0392 18.2246 33.8261 4.4556 0.8621 1.3203 261.3290 9.5493 17.2569 1.6877 13.8763 12.1171 8.2757 0.0049 0.0108 12.5331 0.7414 73.0693 19.5264 67.0995 8.7871 12.9642 5.4868 48.7558 1.8973 16.3804 2.0769 0.0019 21.2177 4.1756 22.8397 158.1937 31.3928 556.4720 85.2417 4.5272 27.0088 71.4678 40.6651 28.3424 11.3360 8.3754 27.7780 6.5251 152.1568 635.5844 7.9353 0.4639 1.2236 1.0750 3.2337 147.7071 54.1188
temp: 298.150 k
press: 1.00000 atm
elementType: 16 8 8 7 7 7 6 6 6 6 6 6 6 6 6 1 1 1 1 1 1 1
symmnumber: 1
zpe: 396520.5 jmol-1
zpe.correction: 0.151027 hartree
zpe.thermalcorrener: 0.164041 hartree
zpe.thermalcorrenthalpy: 0.164985 hartree
zpe.thermalcorrgfe: 0.110140 hartree
zpe.sumelectzpe: -1058.785513 hartree
zpe.sumelectthermal: -1058.772498 hartree
zpe.sumelectthermalent: -1058.771554 hartree
zpe.sumelectthermalfe: -1058.826399 hartree
dipole: 9.0272 0.3480 0.0067
dipole: 9.0339
quadrupole: -103.3761 -81.8112 -97.2396
quadrupole: 11.3222 0.0286 0.0054
quadrupole: -9.2338 12.3311 -3.0973 11.3222 0.0286 0.0054
hfenergy: -1058.9365395 hartree
pointgroup: C01 [X(C9H7N3O2S1)]
dipole: -3.554054 -0.0006847 -0.0342985 debye
dipolederiv: -0.6279506 0.2795111 -0.0077754 -0.285212 -0.3650977 -0.0028555 -0.008826 0.0033617 0.1026863 -1.0121747 -0.1693117 -0.0075695 -0.4685011 -0.6028514 -0.0041721 -0.0069751 -0.0011547 -0.2390851 -0.8638315 0.2260933 -0.0067552 0.5284217 -0.7498089 0.0061702 -0.007431 0.0032483 -0.237507 -1.2778708 -0.2542326 -0.0113498 0.0754494 -0.5621726 0.0010144 -0.0107439 -0.0022147 -0.2295643 2.5103695 -0.1559901 0.0238847 -0.157528 1.1016755 -0.0029444 0.0237342 -0.0030656 0.1901185 -1.1365426 -0.5786644 -0.0067285 -1.0052564 -0.8243726 -0.0094966 -0.009012 -0.0068707 -0.7046751 1.055112 -0.1494033 0.0104746 -0.1969743 0.1117958 -0.0022464 0.0102511 -0.0017219 0.0591084 -0.1730554 0.2003409 -0.0026863 0.7877414 0.2932686 0.008451 -0.0026911 0.0020945 0.0676122 -0.5629581 -0.0673009 -0.004092 -0.2914568 0.0762352 -0.003446 -0.0040364 -0.000944 -0.1438484 -0.5114273 0.2175996 -0.0043933 0.4502424 -0.0840778 0.0043333 -0.0046416 0.0021184 -0.1377929 -1.2860027 0.150947 -0.0139116 0.1099491 0.0226664 0.0010585 -0.0135187 0.0014481 0.042697 0.3785129 0.049298 0.0047827 -0.2890233 -0.0043111 -0.0032204 0.0054832 0.0002419 -0.1022385 0.4778161 -0.1795434 0.0063988 0.1843112 -0.0109222 0.0015866 0.0058771 -0.0021309 -0.1057631 0.7032618 -0.1096112 0.011157 -0.2888489 -0.1951973 -0.0028528 0.0118865 -0.0015939 -0.3288763 1.4727626 0.50735 0.0156565 0.7795681 1.245374 0.0070403 0.0159651 0.004761 0.0954411 0.0536774 0.0947878 -0.0010679 0.0663995 -0.043945 0.0011247 -0.001125 0.0012977 0.140523 0.1070787 -0.0653997 -0.0002289 -0.0748612 0.0344787 -0.0004329 -0.0003369 -0.0003636 0.1515018 0.0767156 -0.0615265 -0.0007892 -0.0198213 0.0607988 0.0000973 -0.0008392 -0.0003824 0.1707529 0.0904994 0.0547686 -0.0009497 0.0161732 0.0444252 0.0005177 -0.000958 0.0008619 0.1691668 0.0548996 -0.0635313 -0.0017708 -0.0742664 0.0525004 -0.0006984 -0.0015808 -0.000565 0.2280963 0.1545864 0.00879 -0.0020591 0.1004607 0.2439055 0.0009901 -0.0021108 0.0004739 0.4048806 0.3165221 0.0650287 -0.0002268 0.0530331 0.1556325 -0.0000186 0.0016292 0.0010999 0.406766 unknown
polarizability: 306.7553049|-11.6961662|152.4053994|2.6470253|-0.2633865|53.092975 unknown
InChI: InChI=1S/C9H7N3O2S/c10-9-11-8(5-15-9)6-1-3-7(4-2-6)12(13)14/h1-5H,10H2
charge 0 multiplicity 1
22 atoms
S  -4.271246 1.27124 -0.052328
O  4.690504 0.841098 0.040451
O  4.44414 -1.4288 0.041808
N  -2.563921 -0.805036 -0.032042
N  3.961185 -0.228377 0.034756
N  -4.861154 -1.478617 -0.056825
C  -0.309123 0.243448 -0.009396
C  -1.777931 0.370389 -0.025174
C  0.547818 1.382009 -0.003435
C  0.276836 -1.055151 -0.00002
C  2.493326 -0.068465 0.019868
C  1.943174 1.23491 0.011119
C  1.672012 -1.218434 0.01464
C  -2.497948 1.560629 -0.032948
C  -3.857024 -0.54355 -0.045957
H  0.123739 2.391061 -0.009922
H  -0.389474 -1.921761 -0.004587
H  2.613634 2.09812 0.015732
H  2.135165 -2.208481 0.021901
H  -2.133894 2.584998 -0.029637
H  -4.602986 -2.4631 -0.05515
H  -5.841932 -1.216331 -0.062055
