program: Gaussian 09
title: 000180687
version: EM64L-G09RevD.01
frameworkgroup: C1[X(C16H26NO4PS)]
method: RPBEPBE
basis: SDD
operation: Freq
keyword: #p
keyword: freq=noraman
keyword: PBEPBE/SDD
title: #p freq=noraman PBEPBE/SDD
converged: NO YES NO NO
title: Mulliken charges:
elementType: S P O O O O N C C C C C C C C C C C C C C C C H H H H H H H H H H H H H H H H H H H H H H H H H H
charge: -0.211518 0.852271 -0.524983 -0.444148 -0.289075 -0.301299 -0.817336 0.306031 -0.700533 -0.661095 -0.686581 0.259276 -0.205121 0.109296 -0.322494 -0.315529 -0.665164 0.040039 0.234152 -0.198961 -0.241138 -0.680694 -0.682037 0.446641 0.222067 0.210751 0.219964 0.200404 0.208653 0.244199 0.243919 0.211468 0.219294 0.219017 0.232951 0.275278 0.266895 0.233726 0.235754 0.226193 0.204688 0.235946 0.234233 0.216535 0.247627 0.221616 0.210022 0.236477 0.222327
chargesum: 0.00000
title: Mulliken charges with hydrogens summed into heavy atoms:
elementType: S P O O O O N C C C C C C C C C C C C C C C C
charge: -0.211518 0.852271 -0.524983 -0.444148 -0.289075 -0.301299 -0.370695 0.306031 -0.047752 -0.007838 -0.011901 0.259276 0.246847 0.109296 -0.047216 -0.048634 0.001471 0.273765 0.234152 0.036985 -0.006905 0.005083 -0.013211
polarizability: 2.74707715e+02 -1.12263018e+00 2.68174728e+02 3.12739848e+00 -2.01033408e+01 1.94445956e+02
1716.lowfreq: -7.9615 -6.0607 -0.0007 0.0010 0.0010 7.6826 9.5746 25.7379 27.3176
frequency: 9.2770 25.3226 27.2664 45.2726 49.6432 54.3854 62.4863 80.3866 85.6995 88.5201 99.5856 117.5204 129.5232 148.5817 156.3798 181.2864 190.5658 201.5171 202.8670 210.4351 225.9866 236.9441 256.8667 263.5976 266.0928 276.1371 281.9826 304.9290 332.0798 348.2017 358.1597 374.9966 377.6961 395.1838 404.7420 427.2282 451.3967 458.7199 460.1538 503.9024 520.1850 539.8065 583.2423 610.3082 651.8046 668.1298 681.3927 713.9207 761.6140 770.4978 771.4485 785.4025 796.5314 810.0018 851.6711 854.7097 877.4853 880.3463 901.3197 907.3093 925.6890 926.5581 943.6021 949.9781 963.8091 992.9666 999.6310 1014.4993 1029.5072 1035.0262 1036.9553 1046.0928 1100.4279 1102.2848 1127.0122 1131.8664 1156.8553 1174.5215 1181.4417 1202.8814 1219.4932 1233.9194 1235.5818 1246.2689 1249.4222 1270.3343 1325.4218 1336.7831 1349.0530 1371.4820 1378.1346 1379.1446 1380.7143 1391.7736 1396.7975 1399.9458 1425.2405 1450.3373 1456.1264 1456.6117 1457.2108 1464.8976 1464.9889 1465.4224 1469.3292 1471.7846 1477.9952 1481.4154 1486.0269 1489.1302 1489.5996 1495.8637 1568.1063 1588.3446 1608.3175 2974.7375 2978.4817 2982.4469 2988.2278 2990.1508 2992.5814 2994.1119 3034.3019 3056.5085 3072.9146 3077.2940 3080.8167 3084.3197 3085.7765 3086.0609 3087.8632 3091.6110 3094.4382 3099.8708 3104.8343 3105.9825 3139.4063 3157.3610 3175.9805 3182.7041 3243.6355
redmass: 4.8650 3.0690 3.3127 3.6046 3.2094 2.9776 4.3121 2.5058 5.5759 5.0529 5.2427 4.3068 4.2489 4.0357 6.0835 3.9368 1.0340 1.1087 3.3047 4.3773 1.2022 1.3578 2.9412 1.3392 1.1059 2.2600 4.0867 4.3354 3.5817 2.9632 3.3343 4.0289 5.1305 3.6020 3.2812 3.6086 4.2309 3.1041 3.5391 3.6563 4.4749 4.2899 6.5417 8.8129 6.7433 4.6440 4.8744 3.2467 3.1873 1.8657 1.8331 2.5049 6.1322 1.0962 5.0282 2.9066 2.4639 1.6840 2.7848 1.6861 1.2127 1.6031 1.3652 1.2034 1.3801 1.3388 3.3621 2.5157 1.4101 2.8363 1.6526 2.9084 1.7268 2.1870 1.8661 1.4399 2.0657 1.0787 1.9492 3.1969 2.6369 3.0172 3.1011 2.9509 1.1713 1.4735 1.5363 1.3395 1.2567 1.2035 1.2217 6.6458 1.3334 1.2436 1.2319 1.2042 2.1978 1.0650 1.0411 1.0776 1.0905 1.0574 1.0518 1.0508 2.0444 1.1165 1.0568 1.0539 1.0497 1.0949 1.1322 1.0583 6.9428 7.7951 6.9489 1.0347 1.0347 1.0360 1.0484 1.0356 1.0452 1.0359 1.0865 1.1058 1.1002 1.1000 1.0997 1.1001 1.0995 1.1002 1.0980 1.0995 1.0987 1.1008 1.1005 1.1021 1.0866 1.0919 1.0946 1.0988 1.0806
irintensity: 0.8145 0.4328 0.2965 0.5856 1.1231 0.2840 1.3872 2.3230 0.5893 0.7075 0.5184 3.9178 1.3679 7.1896 2.5633 0.8404 0.0445 0.8672 3.1581 10.1395 0.2157 0.3911 7.2397 4.9653 1.0262 6.5568 0.7792 8.7078 2.1951 2.5460 1.2690 3.1823 11.1746 11.2166 12.4897 15.0634 11.6739 3.1356 9.4513 35.0701 2.5285 10.3949 23.7500 113.7454 17.2049 59.6782 15.1882 41.4797 17.5546 61.8831 62.4593 15.0827 20.9516 4.6906 95.2855 42.3203 161.3922 54.7542 20.5215 2.5110 2.9179 2.4772 0.0907 0.0790 2.0988 1.0130 93.9764 101.6806 5.1971 126.8880 13.6770 229.0821 97.8010 12.0506 30.0744 3.7222 12.5821 15.0995 44.4690 192.3856 59.2715 25.7651 346.6139 80.3373 1.3166 14.8874 10.4473 3.3625 5.8071 24.1241 23.5482 9.1169 33.0192 24.9459 18.2531 47.3183 22.1599 14.2568 9.4007 44.3795 30.3208 1.0403 9.9028 0.9778 78.2307 35.3896 9.8289 1.3018 15.2974 12.3287 42.7697 12.8259 39.2560 109.8284 210.2746 28.2345 24.6956 21.8037 21.4782 14.4831 34.3694 25.3364 4.6891 12.3209 4.3490 12.4810 47.7636 19.1493 3.1261 18.4818 31.0084 79.0294 53.1584 15.3362 34.4999 37.2329 3.3368 18.0770 4.0337 10.2311 614.1796
temp: 298.150 k
press: 1.00000 atm
elementType: 16 15 8 8 8 8 7 6 6 6 6 6 6 6 6 6 6 6 6 6 6 6 6 1 1 1 1 1 1 1 1 1 1 1 1 1 1 1 1 1 1 1 1 1 1 1 1 1 1
symmnumber: 1
zpe: 1044003.1 jmol-1
zpe.correction: 0.397640 hartree
zpe.thermalcorrener: 0.425374 hartree
zpe.thermalcorrenthalpy: 0.426318 hartree
zpe.thermalcorrgfe: 0.337157 hartree
zpe.sumelectzpe: -1718.467902 hartree
zpe.sumelectthermal: -1718.440167 hartree
zpe.sumelectthermalent: -1718.439223 hartree
zpe.sumelectthermalfe: -1718.528385 hartree
dipole: -4.5629 -3.2336 1.3849
dipole: 5.7614
quadrupole: -144.4096 -140.8266 -152.0153
quadrupole: -6.5564 6.5571 -0.4565
quadrupole: 1.3409 4.9239 -6.2648 -6.5564 6.5571 -0.4565
hfenergy: -1718.8655413 hartree
pointgroup: C01 [X(C16H26N1O4P1S1)]
dipole: 1.7217792 0.8645209 -1.1942003 debye
polarizability: 261.6518467|-19.8615214|248.5759296|-23.796779|-33.7172487|227.1006221 unknown
InChI: InChI=1S/C16H26NO4PS/c1-7-19-22(23,17-16(4,5)6)21-14-11-9-8-10-13(14)15(18)20-12(2)3/h8-12,17H,7H2,1-6H3
charge 0 multiplicity 1
49 atoms
S  -3.155686 -1.8118 1.266047
P  -2.106407 -0.058927 0.987933
O  -0.336491 -0.04586 1.336749
O  -2.600761 1.094455 2.179563
O  3.033708 -0.107711 -1.195504
O  0.814732 0.562648 -1.214147
N  -1.95267 0.712352 -0.531993
C  -3.041053 0.902103 -1.54107
C  -2.541392 2.022604 -2.488437
C  -3.282101 -0.407225 -2.342782
C  -4.343787 1.34794 -0.833758
C  0.493335 -1.1702 1.271219
C  -1.920772 2.424678 2.228519
C  1.567974 -1.205627 0.329534
C  0.335892 -2.210889 2.217167
C  2.492486 -2.285478 0.396072
C  -2.848137 3.348506 3.014019
C  3.32151 0.837035 -2.339695
C  1.722944 -0.17196 -0.732451
C  1.244585 -3.287853 2.239593
C  2.332201 -3.322544 1.333941
C  2.981148 0.129393 -3.659045
C  4.798567 1.205717 -2.190146
H  -0.966946 0.751932 -0.864571
H  -2.379275 2.961579 -1.929939
H  -3.288132 2.206632 -3.281634
H  -1.588733 1.736046 -2.971613
H  -4.064549 -0.255184 -3.109575
H  -2.353152 -0.725255 -2.850616
H  -3.602752 -1.220501 -1.667923
H  -4.713899 0.56981 -0.141388
H  -5.131608 1.535136 -1.585101
H  -4.178981 2.276275 -0.258009
H  -1.748977 2.78268 1.194607
H  -0.945099 2.289162 2.729336
H  -0.498764 -2.158005 2.921749
H  3.327894 -2.296019 -0.308948
H  2.667567 1.717334 -2.200262
H  -3.039433 2.940083 4.020866
H  -3.816306 3.464048 2.497398
H  -2.38289 4.346235 3.123193
H  1.109266 -4.092998 2.969814
H  3.045713 -4.15234 1.3591
H  3.205034 0.797495 -4.510749
H  1.910835 -0.133376 -3.701572
H  3.58204 -0.79013 -3.772988
H  5.086267 1.924936 -2.978181
H  4.990935 1.668457 -1.207446
H  5.437725 0.310414 -2.286177
