program: Gaussian 09
title: 000176624
version: EM64L-G09RevD.01
frameworkgroup: C1[X(C22H30O6)]
method: RPBEPBE
basis: SDD
operation: Freq
keyword: #pfreq=noraman
keyword: PBEPBE/SDD
title: #p freq=noraman PBEPBE/SDD
converged: YES YES NO NO
title: Mulliken charges:
elementType: O O O O O O C C C C C C C C C C C C C C C C C C C C C C H H H H H H H H H H H H H H H H H H H H H H H H H H H H H H
charge: -0.446922 -0.466999 -0.471080 -0.248802 -0.258155 -0.258165 0.424481 -0.120320 -0.142426 -0.168416 0.227062 -0.666179 -0.557206 -0.154238 -0.499790 0.136159 -0.479613 -0.896640 -0.316230 -0.647794 0.574013 -0.774739 -0.189008 -0.656594 0.210197 -0.415202 0.182857 -0.495743 0.257077 0.246509 0.245234 0.217316 0.270501 0.220952 0.228419 0.218750 0.242346 0.236992 0.227048 0.218915 0.231499 0.276533 0.221993 0.256726 0.224347 0.233421 0.278623 0.227746 0.216310 0.343585 0.260264 0.345702 0.261096 0.251146 0.375228 0.239697 0.248715 0.252805
chargesum: 0.00000
title: Mulliken charges with hydrogens summed into heavy atoms:
elementType: O O O O O O C C C C C C C C C C C C C C C C C C C C C C
charge: -0.103337 -0.121298 -0.095852 -0.248802 -0.258155 -0.258165 0.424481 0.136756 0.104083 0.076818 0.227062 -0.178362 -0.107835 0.064512 -0.020452 0.136159 -0.033651 -0.166615 -0.059504 -0.190026 0.574013 -0.052061 0.071256 -0.395498 0.210197 -0.164056 0.182857 0.245474
polarizability: 3.27782992e+02 -6.25121137e+00 2.28370963e+02 -2.86838029e+01 5.73744732e+00 2.03267970e+02
1716.lowfreq: -14.7076 -6.9195 -2.7906 0.0003 0.0005 0.0006 20.6587 31.2229 46.1097
frequency: 20.0057 31.1104 45.9188 55.1912 65.3144 71.8271 97.6122 103.4535 122.4425 140.4339 161.0031 164.7555 174.7036 188.8769 189.2752 207.1176 217.9025 236.5204 239.8375 247.0774 262.1420 276.4104 279.2104 297.5402 303.8022 317.1518 323.6037 327.6248 344.1616 353.6388 362.3428 377.1836 401.9299 416.4420 430.8171 449.3632 463.2649 465.5449 477.6720 490.0616 510.0569 519.1637 546.2987 562.0341 584.7080 588.6796 629.2907 634.6322 665.0578 681.5405 693.9403 695.7683 732.8642 757.4346 784.4286 795.5026 799.4187 824.0393 833.3253 852.9778 857.4104 867.0351 890.4083 905.8918 917.8456 919.0777 923.4900 935.1178 946.0899 955.9148 965.2779 983.2005 1001.1104 1009.8792 1019.9359 1020.4513 1028.8711 1032.1864 1043.8063 1045.8478 1064.2786 1079.9115 1100.2903 1106.0171 1112.1641 1112.8426 1122.2581 1141.8868 1149.3707 1152.2221 1153.9371 1156.8950 1182.1477 1186.2741 1195.6600 1212.9793 1214.8474 1225.2925 1239.3286 1247.6450 1251.7634 1262.2588 1269.6180 1281.7671 1285.0652 1289.6758 1297.5254 1300.7966 1307.2387 1320.6630 1332.5236 1335.0343 1339.3713 1346.5702 1350.0435 1358.5265 1363.0358 1364.6062 1376.8952 1378.3334 1388.8623 1399.1091 1421.9490 1453.1815 1457.0599 1459.1675 1461.3601 1462.0816 1463.7526 1465.4451 1476.3118 1489.8095 1492.8140 1502.9248 1554.5569 1608.9850 1610.1409 1659.1459 2928.2581 2942.3723 2944.9328 2965.3212 2974.4344 2977.1261 2980.4641 2991.6116 2994.0973 2996.4492 3012.7759 3021.7686 3031.4071 3032.5580 3036.8317 3046.7515 3056.5603 3061.6919 3086.2187 3095.2043 3104.1633 3105.8343 3119.9392 3124.0076 3126.8166 3147.1113 3160.4226 3414.3627 3490.3928 3555.7100
redmass: 5.6172 6.0419 4.6649 5.2674 4.1892 3.4557 1.4549 2.6629 4.0229 3.5788 4.0839 3.4835 3.0020 4.5807 1.5033 3.7478 3.3701 3.0877 2.7443 5.1707 3.8206 2.7482 1.8105 1.8800 2.6299 1.6173 2.7666 2.0414 4.0002 4.3602 2.7702 2.8975 3.1455 3.3686 2.8555 1.8254 3.7242 2.1480 2.9271 3.2421 3.9229 3.8210 3.3087 2.5405 1.3880 4.7876 3.4137 4.4595 3.8708 3.7726 3.6002 3.4107 3.6407 4.0280 4.0066 2.6442 1.9041 1.6642 2.1640 2.8305 3.3345 3.1640 2.3715 1.6954 1.9887 2.2199 5.6860 2.0323 1.7666 2.2338 3.5352 2.4203 1.3220 3.3379 2.3655 3.6146 2.0445 2.4512 2.1102 2.4009 2.2117 2.7645 1.8910 2.4210 1.7571 1.2653 2.3567 2.0764 1.5130 1.4353 1.5308 2.2766 1.6380 1.5911 2.8655 1.8318 1.2553 1.3664 1.4034 1.5943 1.4111 1.4971 1.3131 1.4424 1.3413 2.1512 1.3940 1.3397 1.4644 1.3248 1.3611 1.6650 1.4386 1.4782 1.5467 1.4458 1.5039 1.4960 1.6837 1.7380 1.3909 1.1930 1.2140 1.0511 1.0741 1.0788 1.0855 1.0514 1.0748 1.0945 1.0686 1.0745 1.0561 1.0530 8.5535 8.4794 8.0555 7.3259 1.0814 1.0828 1.0801 1.0639 1.0622 1.0571 1.0434 1.0689 1.0592 1.0530 1.0292 1.0821 1.0662 1.0970 1.0971 1.1000 1.0996 1.0988 1.0991 1.1032 1.0960 1.0869 1.1053 1.0989 1.0918 1.0977 1.1056 1.0647 1.0641 1.0657
irintensity: 0.3967 2.6890 0.3644 1.0775 0.8511 0.8365 0.0158 0.2838 1.9743 3.1239 0.5204 3.2467 0.7419 6.3395 1.6720 6.2570 0.4824 5.9085 6.7014 4.0208 9.4254 15.6482 12.7279 27.9473 0.2591 48.5189 34.1943 39.1145 50.5941 6.8971 0.8915 0.5937 17.3999 4.3503 1.7458 73.1990 5.2524 58.9219 17.1273 20.3782 2.0702 2.7630 13.3166 15.2980 86.1602 19.1353 25.6377 0.1204 10.5458 4.5778 32.0332 11.4383 2.0193 0.8162 1.9624 4.3195 2.8945 17.8181 6.3772 12.2149 1.8894 2.2446 0.5349 34.9233 4.9808 28.8840 46.4024 16.5185 10.2852 7.9597 41.2829 30.0407 0.1804 47.5895 7.2638 7.8767 26.7538 4.1209 28.3731 9.2179 27.9965 5.7822 12.5435 13.7602 5.7339 0.1153 13.3693 17.2465 51.1218 1.7904 1.8179 2.2516 24.7755 16.6380 199.4326 11.6225 28.8702 17.1684 91.8015 10.0948 4.8592 2.2302 33.1908 13.9743 5.4513 20.9745 5.4430 1.8933 10.7352 4.4169 5.0782 18.9886 9.4221 4.0524 3.1880 13.8287 18.0586 38.0753 4.5854 12.6677 21.2010 24.2190 24.5708 17.1980 5.6121 20.2958 5.5488 11.1250 9.3063 13.1176 17.0717 0.4147 6.5115 8.9747 188.7355 10.1004 161.8956 171.5614 17.2256 26.4322 12.4519 24.5370 21.6916 41.8129 19.5361 21.0692 3.6152 55.7957 30.1654 11.3594 23.7188 18.8452 50.4819 33.6807 33.6997 16.2209 35.7878 18.3210 15.8154 6.4322 18.6432 3.4771 12.6468 15.2742 10.4659 77.9535 9.0675 4.4019
temp: 298.150 k
press: 1.00000 atm
elementType: 8 8 8 8 8 8 6 6 6 6 6 6 6 6 6 6 6 6 6 6 6 6 6 6 6 6 6 6 1 1 1 1 1 1 1 1 1 1 1 1 1 1 1 1 1 1 1 1 1 1 1 1 1 1 1 1 1 1
symmnumber: 1
zpe: 1268520.8 jmol-1
zpe.correction: 0.483154 hartree
zpe.thermalcorrener: 0.510448 hartree
zpe.thermalcorrenthalpy: 0.511393 hartree
zpe.thermalcorrgfe: 0.427028 hartree
zpe.sumelectzpe: -1305.507125 hartree
zpe.sumelectthermal: -1305.479830 hartree
zpe.sumelectthermalent: -1305.478886 hartree
zpe.sumelectthermalfe: -1305.563250 hartree
dipole: -8.6733 1.1846 3.9038
dipole: 9.5848
quadrupole: -194.9563 -154.9756 -177.1008
quadrupole: -7.7186 15.0296 0.6132
quadrupole: -19.2787 20.7020 -1.4233 -7.7186 15.0296 0.6132
hfenergy: -1305.9902789 hartree
pointgroup: C01 [X(C22H30O6)]
dipole: -3.4171373 0.406311 1.5421123 debye
polarizability: 328.0072164|-5.5821999|227.6657081|-28.2151548|7.5429263|203.7489999 unknown
InChI: InChI=1S/C22H30O6/c1-20-8-6-13(23)10-12(20)4-5-14-15-7-9-22(27,18(25)19(26)28-3)21(15,2)11-16(24)17(14)20/h6,8,10,14-18,24-25,27H,4-5,7,9,11H2,1-3H3
charge 0 multiplicity 1
58 atoms
O  -2.661154 0.102935 -1.685814
O  1.009153 -2.209539 1.496921
O  -3.625823 -2.131616 -0.286987
O  -5.744666 0.834487 0.073056
O  -5.885454 -1.088195 -1.226037
O  6.511786 -0.088405 -2.104693
C  -1.336793 -0.303015 0.429581
C  -0.510757 0.995712 0.166827
C  0.92623 0.943952 0.727043
C  1.669343 -0.273759 0.09081
C  -2.723309 0.133011 -0.20863
C  -0.606316 -1.466601 -0.278056
C  -1.451204 2.136246 0.617205
C  0.879971 -1.611521 0.143836
C  -2.869991 1.632357 0.200032
C  3.192096 -0.363755 0.570335
C  1.677291 2.257454 0.389509
C  -1.537092 -0.593203 1.942237
C  -3.917841 -0.776798 0.200934
C  3.191112 2.208318 0.73541
C  3.837022 0.96334 0.163344
C  3.34887 -0.550553 2.122035
C  3.864356 -1.558948 -0.07622
C  4.900173 1.027096 -0.697452
C  -5.265618 -0.359953 -0.40793
C  4.929666 -1.476676 -0.922903
C  5.520575 -0.170125 -1.302989
C  -7.050926 1.284218 -0.483129
H  -0.423663 1.074351 -0.939789
H  0.889739 0.823134 1.827971
H  1.730828 -0.052045 -0.999386
H  -0.615737 -1.278724 -1.370452
H  -1.130364 -2.428718 -0.114555
H  -1.204748 3.099562 0.138459
H  -1.388393 2.287974 1.711988
H  1.355512 -2.311412 -0.577482
H  -3.605324 1.757484 1.012108
H  -3.258645 2.180859 -0.673944
H  1.207715 3.105861 0.922431
H  1.566339 2.456293 -0.696781
H  -2.056541 -1.559686 2.080964
H  -0.570178 -0.667035 2.462669
H  -2.138724 0.19097 2.437795
H  -4.02919 -0.786938 1.3009
H  3.304538 2.218728 1.838256
H  3.697192 3.112436 0.351046
H  2.926206 -1.518584 2.427286
H  4.420138 -0.50936 2.389276
H  2.823566 0.23781 2.68693
H  -2.709673 -0.856944 -1.946281
H  3.468942 -2.538739 0.223465
H  0.349871 -2.945573 1.56944
H  5.339659 1.99168 -0.981461
H  5.403026 -2.369072 -1.349154
H  -4.431377 -2.440037 -0.792772
H  -7.260448 2.230243 0.03357
H  -7.827408 0.530006 -0.27497
H  -6.961057 1.431813 -1.571501
