program: Gaussian 09
title: 000180543
version: EM64L-G09RevD.01
frameworkgroup: C1[X(C13H7Cl6O3PS)]
method: RPBEPBE
basis: SDD
operation: Freq
keyword: #p
keyword: freq=noraman
keyword: PBEPBE/SDD
title: #p freq=noraman PBEPBE/SDD
converged: YES YES NO NO
title: Mulliken charges:
elementType: Cl Cl Cl Cl Cl Cl S P O O O C C C C C C C C C C C C C H H H H H H H
charge: -0.003154 0.006326 0.012329 0.010389 0.014898 0.015743 -0.138645 0.814885 -0.473946 -0.483828 -0.458581 0.526512 0.517196 -0.311200 -0.316470 -0.270643 -0.260688 -0.055774 -0.056924 -0.183605 -0.181129 -0.097843 -0.098558 -0.474589 0.306964 0.311877 0.286983 0.288018 0.244374 0.251858 0.257226
chargesum: 0.00000
title: Mulliken charges with hydrogens summed into heavy atoms:
elementType: Cl Cl Cl Cl Cl Cl S P O O O C C C C C C C C C C C C C
charge: -0.003154 0.006326 0.012329 0.010389 0.014898 0.015743 -0.138645 0.814885 -0.473946 -0.483828 -0.458581 0.526512 0.517196 -0.311200 -0.316470 0.036320 0.051189 -0.055774 -0.056924 0.103378 0.106889 -0.097843 -0.098558 0.278869
polarizability: 3.63616878e+02 -1.87317527e+01 2.90405453e+02 4.97438498e+00 -6.00588536e+00 1.34624172e+02
1716.lowfreq: -0.0019 -0.0008 0.0011 3.1577 4.8376 7.3923 10.6897 12.2525 16.6345
frequency: 10.5448 11.8965 16.5486 31.1474 42.3073 46.3798 68.9146 71.0596 72.7014 97.7229 108.2633 127.8848 131.3796 138.9146 173.6881 181.0090 185.6195 189.7332 194.7810 205.9603 225.3041 239.1226 267.2013 286.9804 296.7687 312.2435 314.0056 346.4297 351.5789 378.5483 412.9077 415.6309 440.2777 453.1083 453.7986 494.0656 502.6223 521.8995 552.2183 597.4841 604.5695 628.2198 642.1924 660.2286 662.4999 685.0685 685.9561 702.8963 747.1561 749.1599 853.7022 854.1446 883.5523 885.7174 892.2175 894.0127 950.3421 1031.7445 1037.8620 1110.2484 1110.8424 1119.4270 1134.2250 1207.8368 1211.6025 1234.6879 1236.5538 1323.1799 1325.3386 1363.1432 1363.4808 1427.8763 1440.1593 1442.5574 1457.9025 1469.6714 1558.8295 1559.9740 1575.5800 1577.6601 2995.5197 3105.5757 3145.2578 3161.1656 3169.4474 3182.6533 3182.8709
redmass: 21.9281 15.0651 18.3597 12.4207 19.2137 8.4355 16.5444 13.1797 5.0570 9.6152 1.7537 3.6743 3.8040 7.1159 11.1700 29.4457 16.3793 14.8326 6.9803 7.5814 8.9751 9.7253 11.9309 11.6933 16.4217 24.7914 23.8654 12.1155 12.3065 7.9386 9.8474 8.2595 7.9717 3.8133 4.1255 11.5102 7.7195 7.1312 9.7626 11.0074 11.8882 9.6461 9.1752 7.9630 7.8643 4.4099 3.9605 9.9297 11.7678 12.0502 1.4448 1.4387 2.5959 2.1370 1.6528 5.5412 11.7704 7.3990 6.8587 1.7436 1.7980 1.2472 1.2874 5.9003 5.3059 1.2161 1.2584 9.2849 9.1759 10.9020 11.0186 1.1420 2.8425 2.9870 1.0510 1.0531 9.6725 9.8329 8.2032 7.9606 1.0296 1.1054 1.1045 1.0939 1.0931 1.0931 1.0931
irintensity: 0.0875 0.0306 0.1787 0.2861 0.0183 0.4966 0.5796 0.5472 2.3622 0.3770 1.3163 0.6929 1.0645 0.8542 4.3099 0.0891 2.3461 0.4583 1.8528 1.6980 1.1207 3.8207 10.3183 2.6746 8.0615 0.7014 1.0530 4.3861 13.8027 23.6888 10.5985 4.5095 12.2931 5.7301 15.0906 19.8896 1.2588 21.1737 24.2879 43.5748 13.9933 23.4918 47.0419 83.9702 23.9005 12.7721 4.2205 119.1368 231.9098 114.6228 3.7440 8.7850 46.4619 66.4155 53.5884 53.4667 169.3928 210.1452 38.5285 112.9371 24.2725 1.9959 0.2608 89.0922 21.1187 6.4323 1.7527 93.2250 20.0157 19.8766 4.8091 20.0237 412.8540 105.2195 20.2118 22.7041 0.8415 0.7952 4.5139 3.8813 33.6128 15.3558 7.3220 17.1920 5.0605 1.2951 1.2137
temp: 298.150 k
press: 1.00000 atm
elementType: 17 17 17 17 17 17 16 15 8 8 8 6 6 6 6 6 6 6 6 6 6 6 6 6 1 1 1 1 1 1 1
symmnumber: 1
zpe: 449874.6 jmol-1
zpe.correction: 0.171348 hartree
zpe.thermalcorrener: 0.197367 hartree
zpe.thermalcorrenthalpy: 0.198311 hartree
zpe.thermalcorrgfe: 0.108946 hartree
zpe.sumelectzpe: -4223.139314 hartree
zpe.sumelectthermal: -4223.113295 hartree
zpe.sumelectthermalent: -4223.112351 hartree
zpe.sumelectthermalfe: -4223.201716 hartree
dipole: 0.1431 2.5862 -0.1348
dipole: 2.5936
quadrupole: -200.9415 -178.6495 -201.6216
quadrupole: 5.8493 0.9320 -0.1800
quadrupole: -7.2039 15.0880 -7.8841 5.8493 0.9320 -0.1800
hfenergy: -4223.310662 hartree
pointgroup: C01 [X(C13H7Cl6O3P1S1)]
dipole: -0.1036862 -1.0135597 -0.0563804 debye
polarizability: 361.6971862|-22.0243079|292.2601508|-5.2099746|6.825202|134.6891663 unknown
InChI: InChI=1S/C13H7Cl6O3PS/c1-20-23(24,21-12-4-8(16)6(14)2-10(12)18)22-13-5-9(17)7(15)3-11(13)19/h2-5H,1H3
charge 0 multiplicity 1
31 atoms
Cl -3.970912 -2.8661 -0.018153
Cl 1.128931 2.753119 -0.069673
Cl -3.225718 3.514523 -0.148377
Cl 5.906507 -1.543796 -0.085979
Cl -6.150277 2.186824 0.570942
Cl 6.511126 1.630608 0.536459
S  -0.06969 -1.327272 2.234833
P  0.029288 -1.440476 0.196676
O  -1.452109 -1.354596 -0.73653
O  0.898493 -0.20042 -0.688292
O  0.728208 -2.824583 -0.543096
C  -2.514024 -0.505129 -0.373974
C  2.208682 0.184435 -0.342083
C  -3.771543 -1.070812 -0.060554
C  2.474196 1.547893 -0.075829
C  -2.360127 0.897559 -0.402461
C  3.267258 -0.749955 -0.34721
C  -3.460291 1.725048 -0.111489
C  4.579053 -0.320185 -0.075844
C  -4.875407 -0.245263 0.218508
C  3.787237 1.980714 0.183695
C  -4.71682 1.156151 0.196374
C  4.840845 1.043189 0.187789
C  0.211904 -4.161362 -0.134504
H  -1.387307 1.330419 -0.656244
H  3.053731 -1.79941 -0.571388
H  -5.847641 -0.682767 0.458079
H  3.9915 3.034551 0.388422
H  0.26019 -4.275246 0.963217
H  0.88699 -4.875057 -0.627253
H  -0.822071 -4.287005 -0.496259
