program: Gaussian 09
title: 000176615
version: EM64L-G09RevD.01
frameworkgroup: C1[X(C5H7NOS)]
method: RPBEPBE
basis: SDD
operation: Freq
keyword: #p
keyword: freq=noraman
keyword: PBEPBE/SDD
title: #p freq=noraman PBEPBE/SDD
converged: YES YES NO NO
title: Mulliken charges:
elementType: S O N C C C C C H H H H H H H
charge: 0.247707 -0.164577 0.025120 -0.364360 -0.674113 -0.453505 -0.220676 -0.081103 0.241717 0.220717 0.272024 0.268235 0.231705 0.244182 0.206926
chargesum: 0.00000
title: Mulliken charges with hydrogens summed into heavy atoms:
elementType: S O N C C C C C
charge: 0.247707 -0.164577 0.025120 0.098074 -0.133854 0.022382 -0.220676 0.125823
polarizability: 1.02028083e+02 -4.94156482e+00 8.81779368e+01 2.47925463e+00 -9.59735601e-01 4.51489175e+01
1716.lowfreq: -9.6631 -0.0031 -0.0012 0.0018 15.3738 20.8354 74.9277 112.1960 182.2805
frequency: 74.7886 112.1926 182.2732 242.9584 311.6478 339.7702 404.5499 489.3311 524.2749 549.4281 612.2012 656.9420 832.9113 857.9838 893.4917 967.2211 992.0369 1037.7918 1076.7105 1130.3662 1150.5435 1191.7570 1255.1364 1292.3372 1332.3772 1343.2856 1352.6112 1439.8578 1450.6573 1455.1618 1583.2826 1624.3614 2945.1165 2972.9154 2996.2889 3033.0641 3039.4668 3060.9212 3110.3806
redmass: 3.4386 3.7502 9.8437 2.2569 1.9595 7.4679 3.5945 4.2836 6.3088 4.7166 3.7686 5.1247 1.6253 2.2649 2.6817 1.7175 2.6260 1.6273 2.3842 6.0482 1.2300 1.3381 1.1714 1.2092 1.3200 1.2421 1.3253 1.1079 1.0835 1.0972 6.7345 9.7420 1.0885 1.0658 1.0612 1.0626 1.0936 1.0991 1.1078
irintensity: 0.7025 2.3117 8.6025 7.5148 13.2575 3.6362 1.2956 0.4544 34.9074 20.7143 0.5286 53.3807 1.6603 6.2364 18.1564 2.9988 20.8252 4.1832 6.3414 51.2971 0.8482 1.3488 8.3117 16.2889 1.6796 1.4436 10.9655 9.2759 14.3304 15.0159 89.9145 141.6116 80.1828 22.2996 23.2527 17.3712 27.3958 28.6764 13.4711
temp: 298.150 k
press: 1.00000 atm
elementType: 16 8 7 6 6 6 6 6 1 1 1 1 1 1 1
symmnumber: 1
zpe: 298578.3 jmol-1
zpe.correction: 0.113722 hartree
zpe.thermalcorrener: 0.121598 hartree
zpe.thermalcorrenthalpy: 0.122542 hartree
zpe.thermalcorrgfe: 0.080783 hartree
zpe.sumelectzpe: -722.124807 hartree
zpe.sumelectthermal: -722.116932 hartree
zpe.sumelectthermalent: -722.115988 hartree
zpe.sumelectthermalfe: -722.157747 hartree
dipole: -5.1212 0.9523 -0.2470
dipole: 5.2148
quadrupole: -56.3733 -56.0009 -53.8869
quadrupole: 4.2293 -0.0017 0.3526
quadrupole: -0.9530 -0.5805 1.5335 4.2293 -0.0017 0.3526
hfenergy: -722.2385294 hartree
pointgroup: C01 [X(C5H7N1O1S1)]
dipole: -1.9281946 0.6440311 -0.2767702 debye
dipolederiv: -0.1618772 -0.2276147 0.0014253 -0.2908381 -0.5759887 -0.1099076 -0.0027845 -0.0501868 -0.0398515 -0.827496 0.0932404 -0.0816538 0.2771212 -0.5125704 0.0359709 -0.0830899 0.0161102 -0.3084415 -0.2118331 0.0050128 0.0698247 -0.2616128 -0.9128118 -0.055857 0.0502267 -0.050898 -0.2403109 -0.1540931 0.0400469 0.0266132 -0.0107129 -0.0531108 0.0004693 -0.0214734 -0.0049469 0.0838258 0.3483405 0.0277825 0.0572948 0.0093823 -0.0201046 -0.0099829 0.0638154 -0.0335644 0.1326834 0.2280348 -0.1470914 -0.0664238 -0.0117738 0.2508864 -0.0359456 -0.1308596 0.0539829 0.2156608 -0.3055957 0.2570423 -0.0565604 0.5569973 1.1329181 0.1659425 -0.0565709 0.1158276 -0.0151827 1.2103976 -0.1058805 0.1782774 -0.1287452 0.6451134 -0.0054105 0.1809621 -0.0249545 0.1669069 0.1108206 -0.0013686 -0.0400855 -0.0246853 0.0380963 0.0276275 0.0323601 0.0131449 -0.1224875 -0.1760179 0.0560195 -0.0336081 0.0702982 0.0846459 -0.0022957 -0.0249226 -0.0079292 0.0983283 -0.0231111 -0.0845448 -0.001348 -0.0645662 -0.0362748 0.0279644 0.0171103 0.0331446 0.0919012 -0.0172092 -0.0077431 -0.0379731 0.0608972 0.080162 0.0536864 -0.0484975 -0.0120107 -0.1202314 -0.009775 0.0645509 -0.0105972 -0.0467839 0.1103852 0.026145 -0.031606 0.0929052 -0.1050407 0.0019985 0.0726859 0.0185456 0.0260917 -0.0571389 -0.0806838 0.085002 -0.1232437 0.0533317 -0.0125839 -0.0421382 -0.0237312 -0.1610698 -0.1742073 -0.037723 -0.029672 -0.0173813 0.108908 unknown
polarizability: 99.2755356|-6.994877|89.6250585|8.2871238|1.5776815|46.4543428 unknown
InChI: InChI=1S/C5H7NOS/c7-4-5-6-2-1-3-8-5/h4H,1-3H2
charge 0 multiplicity 1
15 atoms
S  -0.013089 -1.680201 -0.031997
O  2.855274 -0.90269 0.495076
N  0.001267 1.183439 0.107125
C  -2.280061 0.033938 0.299092
C  -1.818313 -1.229211 -0.44523
C  -1.460519 1.284042 -0.090247
C  0.63069 0.043553 0.156382
C  2.112372 0.102835 0.406744
H  -2.209491 -0.134088 1.389952
H  -3.345193 0.222075 0.063302
H  -2.399887 -2.115138 -0.14517
H  -1.885374 -1.106187 -1.538742
H  -1.626964 1.536748 -1.158452
H  -1.800377 2.162409 0.488264
H  2.483563 1.148873 0.513001
