program: Gaussian 09
title: 000180631
version: EM64L-G09RevD.01
frameworkgroup: C1[X(C23H23Cl2N3O4S)]
method: RPBEPBE
basis: SDD
operation: Freq
keyword: #p
keyword: freq=noraman
keyword: PBEPBE/SDD
title: #p freq=noraman PBEPBE/SDD
converged: YES YES NO NO
title: Mulliken charges:
elementType: Cl Cl S O O O O N N N C C C C C C C C C C C C C C C C C C C C C C C H H H H H H H H H H H H H H H H H H H H H H H
charge: -0.035461 -0.038887 0.202324 -0.290950 -0.231352 -0.308412 -0.280157 -0.115653 -0.109052 -0.463864 0.162149 0.033922 -0.360306 -0.471906 0.541944 -0.751838 -0.335616 -0.307277 -0.130007 -0.193183 -0.208943 -0.211416 -0.120286 -0.347136 -0.245898 -0.190773 -0.211968 -0.452531 -0.321784 0.487813 0.277634 -0.252289 -0.661399 0.249587 0.245780 0.215301 0.258900 0.249261 0.282179 0.263878 0.298068 0.272418 0.257728 0.283434 0.260349 0.277998 0.254602 0.250044 0.229926 0.298907 0.331713 0.241607 0.226399 0.249933 0.224992 0.219553
chargesum: 0.00000
title: Mulliken charges with hydrogens summed into heavy atoms:
elementType: Cl Cl S O O O O N N N C C C C C C C C C C C C C C C C C C C C C C C
charge: -0.035461 -0.038887 0.202324 -0.290950 -0.231352 -0.308412 -0.280157 -0.115653 -0.109052 -0.132151 0.162149 0.283510 0.100774 0.036255 0.541944 -0.205781 -0.335616 -0.009209 0.142411 0.064544 0.074491 0.048933 -0.120286 -0.069137 -0.245898 0.063830 0.038075 -0.222605 -0.022877 0.487813 0.277634 0.215717 0.033080
polarizability: 3.58972163e+02 -4.47690063e+01 3.04308436e+02 9.95331837e+00 -1.34643717e+01 2.66923685e+02
1716.lowfreq: -10.2151 -6.6705 -0.0020 -0.0016 0.0007 4.2952 10.0263 20.3094 21.7671
frequency: 9.6448 20.2289 21.7257 25.4377 30.9532 34.3325 40.9778 48.1863 51.9608 64.3211 72.4071 82.5864 90.5732 105.7463 111.3510 127.2536 146.1205 162.4573 166.7691 174.1697 184.1901 186.8890 205.4615 245.4437 249.1231 263.6242 269.1319 286.8937 303.6704 315.3748 319.3489 340.2682 358.4966 366.9177 374.1837 382.2870 400.2345 408.2213 414.1277 450.0505 463.9543 474.4140 494.7195 523.8912 543.6691 595.8039 621.3806 623.7413 632.8439 642.5462 652.8684 653.4621 657.4243 675.7871 679.6459 695.9090 702.7793 716.3430 727.2802 729.2067 732.4473 757.0902 773.9336 788.1568 802.5066 804.8001 823.5280 829.4622 848.0248 862.0361 867.0430 867.3703 869.3695 879.2058 880.9314 946.7645 950.0533 959.4338 973.9506 988.6495 989.5841 994.0397 996.9659 1004.7899 1013.3789 1035.5112 1044.3856 1052.4905 1057.8634 1078.0246 1078.9755 1088.0077 1095.7074 1105.2984 1115.5510 1125.8853 1136.6306 1155.3818 1168.4169 1171.5021 1184.5937 1187.9689 1208.5268 1218.1527 1232.5856 1238.8850 1255.8880 1263.4908 1272.2079 1282.4095 1294.0752 1297.5537 1321.1270 1336.9797 1345.0636 1348.1801 1354.4407 1354.7952 1366.7622 1370.5508 1374.2381 1391.7466 1404.4217 1415.1860 1434.5455 1450.0003 1458.2985 1462.9044 1464.4645 1470.1089 1476.2242 1480.1755 1484.0283 1507.7399 1564.0371 1584.2715 1589.0519 1607.6076 1657.7967 2982.9574 2993.2581 3015.8196 3030.9697 3032.7173 3037.5951 3088.7735 3093.9201 3098.8116 3105.3075 3112.2169 3115.7873 3120.3582 3150.8988 3154.7884 3168.7938 3181.3301 3185.5218 3189.6066 3224.2360 3227.2961 3262.1413 3540.4656
redmass: 8.2565 8.4349 6.3468 4.9460 9.5275 5.6196 6.2333 3.7602 4.9527 4.7684 4.9392 5.4373 5.9505 4.3216 4.2735 4.4933 8.3636 5.8543 7.0330 6.0135 9.6284 2.7898 1.7229 3.5777 4.0676 6.9257 7.1658 5.2033 7.1243 3.3110 4.9265 5.4230 5.3604 2.6884 8.7961 4.9995 4.4682 2.6745 2.9380 3.4582 4.5515 6.8140 5.6111 2.6638 5.2362 3.6045 6.2526 3.5449 3.7609 1.3327 5.0451 4.6178 5.0798 5.5283 6.1960 7.1627 5.3338 3.7053 3.6307 1.5808 3.1681 6.8595 1.4108 3.9422 2.5059 1.5140 1.5450 1.8605 1.8804 1.4594 1.4249 1.5360 2.9543 2.0481 4.3270 1.4019 4.2198 3.3716 7.3023 1.6913 1.6770 1.7940 3.8749 2.7294 3.7028 4.4162 2.4871 1.8304 2.5752 3.0529 2.8552 2.7364 2.1599 1.8100 1.3622 2.7081 1.4596 1.7904 2.9032 1.5109 1.4244 1.1877 1.2498 1.5494 2.4975 1.1913 1.3869 2.0621 1.8602 1.1116 1.3689 1.3427 1.1600 2.3687 1.7441 2.2266 2.5511 1.7835 2.4635 2.3571 4.0494 1.2388 3.9349 1.1004 1.6813 2.5510 1.0860 1.0499 1.6785 1.0891 2.1392 3.2639 1.0600 2.6392 8.4804 5.0407 7.1841 6.0615 7.5358 1.0674 1.0360 1.0595 1.0866 1.0599 1.0594 1.0974 1.1030 1.1037 1.1046 1.0991 1.0891 1.1063 1.0944 1.0919 1.0887 1.0934 1.0962 1.0951 1.0946 1.0970 1.1067 1.0761
irintensity: 0.0665 1.3665 0.3872 1.8881 1.7285 0.6324 0.4689 0.2791 0.7443 1.8616 1.0195 0.4962 4.0939 1.5032 1.1882 6.4375 0.4048 0.5227 0.2730 0.1950 1.0311 0.5383 5.7036 0.8504 2.9659 0.6255 4.2296 0.5039 0.4050 25.3090 1.5715 7.5844 1.6405 2.4394 3.3256 3.0965 3.7294 2.3405 1.1614 7.7181 0.1345 20.5209 9.1101 53.4096 1.9599 2.9388 3.4952 6.0536 13.3602 40.6499 6.3766 4.8987 15.2439 12.8376 5.3755 11.1536 51.3670 3.0726 5.9065 26.4352 20.3008 21.8649 108.1901 30.6241 2.5773 2.4562 23.0799 58.8965 38.4817 85.8506 10.1331 15.8208 2.3127 7.1107 16.1697 0.4235 13.4173 36.9629 40.2821 40.4678 56.8899 22.2664 11.0861 15.9766 5.4275 274.7726 39.7372 6.7457 2.5018 15.6070 10.5749 33.2501 41.9620 14.5088 14.2398 58.9904 8.3424 170.5825 314.3338 19.5814 2.7414 15.2869 3.5504 17.4495 49.6858 3.2107 4.6854 3.4859 27.2616 8.1802 10.5012 9.3438 2.6354 7.6819 15.2604 4.4670 24.5370 46.2522 65.5025 7.2751 6.4964 31.6234 28.4803 12.8853 23.6451 52.3201 15.4805 10.1014 30.7450 7.1432 1.5694 10.3937 8.9573 643.1087 38.1661 50.5443 87.4563 95.5751 181.0770 34.8242 22.4414 21.4783 20.6373 27.8377 17.5019 35.8214 1.4021 5.7474 2.4399 26.3599 13.0544 33.5694 8.6457 0.3540 3.7518 1.6912 1.5649 2.8484 0.9291 0.7879 0.1422 33.2956
temp: 298.150 k
press: 1.00000 atm
elementType: 17 17 16 8 8 8 8 7 7 7 6 6 6 6 6 6 6 6 6 6 6 6 6 6 6 6 6 6 6 6 6 6 6 1 1 1 1 1 1 1 1 1 1 1 1 1 1 1 1 1 1 1 1 1 1 1
symmnumber: 1
zpe: 1108080.6 jmol-1
zpe.correction: 0.422046 hartree
zpe.thermalcorrener: 0.453897 hartree
zpe.thermalcorrenthalpy: 0.454841 hartree
zpe.thermalcorrgfe: 0.353502 hartree
zpe.sumelectzpe: -2671.160221 hartree
zpe.sumelectthermal: -2671.128370 hartree
zpe.sumelectthermalent: -2671.127425 hartree
zpe.sumelectthermalfe: -2671.228764 hartree
dipole: -0.7266 2.6286 3.3585
dipole: 4.3264
quadrupole: -186.2136 -225.6720 -215.1063
quadrupole: -14.2461 8.1322 -4.8962
quadrupole: 22.7837 -16.6747 -6.1090 -14.2461 8.1322 -4.8962
hfenergy: -2671.5822669 hartree
pointgroup: C01 [X(C23H23Cl2N3O4S1)]
dipole: 0.185923 0.9360106 -1.4094445 debye
polarizability: 360.9774601|45.1662076|304.4812729|-0.8892679|6.957082|264.7455517 unknown
InChI: InChI=1S/C23H23Cl2N3O4S/c1-2-30-22(29)27-17-4-6-19(7-5-17)33-13-18-12-31-23(32-18,14-28-10-9-26-15-28)20-8-3-16(24)11-21(20)25/h3-11,15,18,27H,2,12-14H2,1H3
charge 0 multiplicity 1
56 atoms
Cl 4.64188 -2.385259 0.360604
Cl 1.123808 -3.787905 -3.642819
S  0.879895 4.195174 -1.341836
O  2.052268 1.54225 0.48824
O  4.220847 0.677097 0.645437
O  -5.309816 -1.224424 -0.243182
O  -4.181601 0.055161 1.385839
N  1.240836 -0.786072 2.365591
N  -0.378243 -2.352857 2.649282
N  -3.738307 0.231963 -0.939885
C  2.807129 0.28528 0.708996
C  2.955743 2.52233 -0.19448
C  4.277879 1.726897 -0.387978
C  2.565246 -0.201612 2.159184
C  2.431005 -0.748722 -0.367454
C  2.365727 3.020317 -1.516921
C  3.158365 -1.939686 -0.612154
C  1.255808 -0.545519 -1.135574
C  0.016855 -0.100619 2.378551
C  0.946511 -2.142601 2.528511
C  2.780738 -2.867553 -1.604025
C  0.840717 -1.45499 -2.128952
C  1.621173 -2.602303 -2.355662
C  -0.965869 -1.076677 2.552663
C  -0.521057 3.001552 -1.212509
C  -1.012607 2.341111 -2.363738
C  -1.139829 2.771877 0.036608
C  -2.081385 1.429099 -2.253406
C  -2.219263 1.873857 0.158607
C  -2.684891 1.179123 -0.989812
C  -4.380561 -0.265271 0.187073
C  -6.11221 -1.879214 0.832736
C  -7.350258 -1.047359 1.176097
H  3.089518 3.364707 0.508012
H  5.182293 2.320968 -0.191254
H  4.331405 1.270426 -1.396866
H  2.714436 0.667968 2.820823
H  3.330275 -0.960293 2.392713
H  2.066028 2.179187 -2.163135
H  3.120852 3.628392 -2.04887
H  0.658959 0.347559 -0.93363
H  -0.033651 0.975799 2.246519
H  1.718433 -2.909214 2.554874
H  3.370758 -3.771247 -1.774048
H  -0.072271 -1.272631 -2.701602
H  -2.044253 -0.940548 2.601051
H  -0.564689 2.542732 -3.342553
H  -0.762086 3.291372 0.922763
H  -2.453451 0.917885 -3.150405
H  -2.686583 1.686288 1.127185
H  -4.041865 -0.187711 -1.821509
H  -5.46339 -2.020673 1.714624
H  -6.37476 -2.856131 0.396671
H  -7.061196 -0.080084 1.620224
H  -7.964283 -0.862541 0.277761
H  -7.97021 -1.592157 1.91222
