program: Gaussian 09
title: 000176598
version: EM64L-G09RevD.01
frameworkgroup: C1[X(C19H15NO4)]
method: RPBEPBE
basis: SDD
operation: Freq
keyword: #p
keyword: freq=noraman
keyword: PBEPBE/SDD
title: #p freq=noraman PBEPBE/SDD
converged: YES YES NO NO
title: Mulliken charges:
elementType: O O O O N C C C C C C C C C C C C C C C C C C C H H H H H H H H H H H H H H H
charge: -0.470462 -0.282788 -0.253130 -0.255898 -0.070948 -0.029656 0.004873 0.374839 0.239128 -0.103724 0.148538 0.565554 -0.032608 -0.712755 0.181107 -0.546231 -0.630629 -0.383213 -0.379658 0.335675 -0.396914 -0.388809 -0.198980 -0.536207 0.238019 0.220602 0.248768 0.307158 0.264931 0.282357 0.239072 0.365206 0.241369 0.242492 0.237425 0.245637 0.247130 0.222462 0.220270
chargesum: 0.00000
title: Mulliken charges with hydrogens summed into heavy atoms:
elementType: O O O O N C C C C C C C C C C C C C C C C C C C
charge: -0.105257 -0.282788 -0.253130 -0.255898 -0.070948 -0.029656 0.004873 0.374839 0.239128 -0.103724 0.148538 0.565554 -0.032608 -0.005366 0.181107 -0.239073 -0.365698 -0.100856 -0.140586 0.335675 -0.155545 -0.146318 0.284083 0.153654
polarizability: 3.47773568e+02 -7.99744603e+00 2.84457249e+02 -4.94166271e+00 7.40416180e+00 1.13998853e+02
1716.lowfreq: -10.5040 -5.7563 -4.8623 -0.0004 0.0003 0.0006 32.9302 58.7490 82.3418
frequency: 32.8823 58.7477 82.3377 86.4313 116.3337 123.8821 131.0834 154.5029 164.6706 215.2368 224.0711 245.1724 257.9977 267.3768 273.4185 286.0947 300.0633 315.8608 351.9526 359.0704 367.7026 401.9571 419.8012 449.7925 463.1384 492.5067 524.1878 540.6208 569.6825 577.9366 594.4752 603.2525 619.3466 644.0990 648.8643 688.2925 709.7687 715.2423 736.4932 756.2423 789.3363 803.4789 816.5992 819.7357 839.5233 850.9828 877.0241 888.5255 907.4728 911.6530 918.2337 953.2603 959.5674 965.5577 993.4143 1001.2513 1022.3490 1031.8188 1047.9844 1073.7060 1078.0546 1110.0359 1114.7522 1131.7495 1146.3393 1160.2764 1181.5161 1188.2240 1201.2193 1235.4206 1253.1562 1279.7087 1283.7806 1329.4660 1351.7945 1360.9747 1367.1993 1382.9210 1386.2957 1398.6088 1418.2669 1433.2661 1434.7285 1447.5995 1457.5421 1466.5720 1468.2883 1476.0518 1479.0427 1489.6152 1498.0620 1563.0652 1573.8720 1610.7552 1622.4740 1629.1235 2960.5531 2981.3764 3004.1142 3049.1120 3085.7009 3099.5335 3117.2742 3126.1876 3138.5189 3154.2798 3162.5587 3175.4948 3179.9176 3181.5050 3374.9212
redmass: 4.8442 4.1827 3.2439 3.5638 3.7441 4.9195 4.5270 6.6534 3.4509 4.2461 1.2783 1.2810 3.6924 2.6354 5.1552 4.4873 5.0748 5.5522 6.5790 4.7482 5.5687 5.8454 6.8666 4.9982 3.6612 4.6524 1.4707 2.5131 5.7480 3.9068 5.7314 5.0562 4.8394 5.5381 4.5152 8.3031 7.5818 6.2738 6.1157 4.1495 5.4296 3.3774 1.3498 1.6999 6.8725 5.3302 1.6937 4.4164 3.8254 2.6404 2.1388 1.3568 1.7444 2.4683 4.5109 4.7085 6.4133 3.7995 1.9969 1.5024 2.3878 1.2605 1.9720 1.0760 1.4436 2.1076 1.5383 1.5154 2.8288 2.8771 2.1222 1.6298 3.9593 3.4988 2.0791 1.4750 1.2780 4.2354 3.6288 2.9860 3.5018 4.2882 1.2533 1.6427 1.0709 1.0542 1.3082 1.3565 1.2907 2.8809 3.0965 7.4780 8.3705 8.4611 8.7583 7.1310 1.0329 1.0334 1.0610 1.1039 1.1006 1.1013 1.1100 1.0994 1.0871 1.0887 1.0986 1.0920 1.0937 1.0948 1.0643
irintensity: 1.2994 1.9951 2.2012 9.5934 3.9334 1.1685 6.7621 0.4049 2.4220 5.4189 0.3910 1.1170 1.9211 3.4324 1.4487 4.1664 2.8633 1.3104 0.4027 0.7510 2.0683 6.8618 0.8165 0.2219 7.3401 2.0645 46.6301 62.9433 37.5835 25.7337 6.5075 4.5120 3.3286 5.9460 1.6713 2.4030 2.4945 3.3747 1.8152 2.1404 16.4094 4.9425 5.5775 34.8545 25.4725 27.2638 63.9977 11.5303 9.9641 12.5402 43.5571 3.0632 15.0809 37.4432 114.1853 95.0655 38.8051 31.0871 17.3015 8.5566 7.6148 0.1988 32.3136 3.6260 6.8305 169.1295 71.1810 24.1142 76.2736 146.6841 10.2676 54.2618 104.4491 115.1360 60.8775 0.7522 17.1319 15.2377 77.0200 5.3567 112.6475 66.8223 12.9628 49.3232 19.7897 14.6464 70.5229 4.6400 0.5111 3.0878 82.0768 106.6865 37.8942 145.3694 36.4994 88.4047 88.6494 16.7938 124.9868 47.2883 21.8112 14.3282 24.2467 26.7419 3.0135 12.7679 42.1695 0.6653 1.1381 6.8219 48.9378
temp: 298.150 k
press: 1.00000 atm
elementType: 8 8 8 8 7 6 6 6 6 6 6 6 6 6 6 6 6 6 6 6 6 6 6 6 1 1 1 1 1 1 1 1 1 1 1 1 1 1 1
symmnumber: 1
zpe: 776633.2 jmol-1
zpe.correction: 0.295804 hartree
zpe.thermalcorrener: 0.315218 hartree
zpe.thermalcorrenthalpy: 0.316162 hartree
zpe.thermalcorrgfe: 0.248925 hartree
zpe.sumelectzpe: -1086.979726 hartree
zpe.sumelectthermal: -1086.960311 hartree
zpe.sumelectthermalent: -1086.959367 hartree
zpe.sumelectthermalfe: -1087.026605 hartree
dipole: 1.4983 4.9433 0.9499
dipole: 5.2520
quadrupole: -118.9438 -125.8117 -140.4359
quadrupole: -14.5037 0.3770 -0.0621
quadrupole: 9.4533 2.5855 -12.0388 -14.5037 0.3770 -0.0621
hfenergy: -1087.2755296 hartree
pointgroup: C01 [X(C19H15N1O4)]
dipole: -0.5522215 -1.9421126 0.4390903 debye
polarizability: 348.1015443|-6.8376484|283.5763287|3.3909495|-12.5635123|114.5517974 unknown
InChI: InChI=1S/C19H15NO4/c1-19(21)13-8-11(22-2)3-4-12(13)16-15-10(5-6-20-18(15)19)7-14-17(16)24-9-23-14/h3-8,21H,9H2,1-2H3
charge 0 multiplicity 1
39 atoms
O  1.387812 3.134349 -0.404507
O  -0.925152 -3.090154 0.309097
O  -3.297933 -3.061309 0.091159
O  5.090666 -0.170515 -0.343334
N  -1.305669 3.065862 -0.417524
C  0.761277 2.016119 0.308454
C  -1.362816 0.631883 -0.106747
C  1.544704 0.732165 0.059788
C  -0.594303 -0.591492 0.081716
C  -0.698307 1.8942 -0.123277
C  0.880225 -0.537433 0.065158
C  -2.798479 0.630462 -0.304998
C  -1.373059 -1.748167 0.15761
C  0.781296 2.332086 1.83997
C  -2.794584 -1.743075 0.014982
C  2.937517 0.809255 -0.083009
C  -3.533545 -0.601407 -0.234546
C  1.679901 -1.709279 -0.037417
C  -3.430573 1.885883 -0.579604
C  3.711788 -0.369595 -0.200738
C  3.08041 -1.638912 -0.163785
C  -2.661507 3.050084 -0.659491
C  -2.150592 -3.90145 0.506328
C  5.938979 -1.3569 -0.48246
H  0.194151 3.247432 2.031984
H  0.362718 1.500955 2.436252
H  1.826339 2.501322 2.150227
H  3.426974 1.785893 -0.118815
H  -4.616367 -0.631929 -0.375551
H  1.198824 -2.689908 -0.033977
H  -4.512498 1.92865 -0.740758
H  0.629526 3.761772 -0.596384
H  3.658512 -2.564146 -0.243301
H  -3.113972 4.015475 -0.906896
H  -2.251936 -4.149283 1.579643
H  -2.1009 -4.789426 -0.141162
H  6.961917 -0.966676 -0.586159
H  5.668957 -1.941107 -1.383549
H  5.8760 -2.004883 0.413421
