program: Gaussian 09
title: 000176573
version: EM64L-G09RevD.01
frameworkgroup: C1[X(C19H16N2O4)]
method: RPBEPBE
basis: SDD
operation: Freq
keyword: #p
keyword: freq=noraman
keyword: PBEPBE/SDD
title: #p freq=noraman PBEPBE/SDD
converged: YES YES NO NO
title: Mulliken charges:
elementType: O O O O N N C C C C C C C C C C C C C C C C C C C H H H H H H H H H H H H H H H H
charge: -0.425926 -0.400960 -0.216845 -0.228586 -0.342567 -0.019042 0.260380 0.466394 -0.029212 0.306745 0.364575 -0.550533 -0.031497 0.324774 -0.414862 -0.406825 -0.354219 -0.363613 -0.814375 -0.807857 0.095579 0.126961 -0.232208 -0.239679 -0.235769 0.271580 0.279510 0.237293 0.256187 0.278501 0.236260 0.227303 0.229083 0.227373 0.232771 0.229509 0.232432 0.232323 0.233241 0.382413 0.383391
chargesum: 0.00000
title: Mulliken charges with hydrogens summed into heavy atoms:
elementType: O O O O N N C C C C C C C C C C C C C C C C C C C
charge: -0.043513 -0.017569 -0.216845 -0.228586 -0.342567 -0.019042 0.260380 0.466394 -0.029212 0.306745 0.364575 -0.278953 -0.031497 0.324774 -0.135352 -0.169532 -0.098033 -0.085112 -0.121729 -0.118204 0.095579 0.126961 0.000225 -0.007357 -0.002528
polarizability: 3.18126584e+02 1.23055443e+01 2.61014214e+02 1.24151937e+01 -2.52891992e+01 1.49931719e+02
1716.lowfreq: -3.5555 -0.0008 -0.0006 -0.0004 3.7909 6.5099 24.0667 31.4304 35.9594
frequency: 24.0609 31.3548 35.9216 46.1578 52.7380 59.9752 70.6995 100.9095 111.4102 132.4877 134.5728 161.1620 166.6726 171.2820 199.4153 234.0087 241.5621 258.2829 280.5151 296.8125 303.1271 338.7410 377.6137 406.2948 418.9014 424.4160 446.5302 472.1105 496.9239 514.4808 539.9590 560.9020 579.7110 591.0058 614.3662 623.5734 637.0513 645.2808 656.8100 682.1311 696.4675 702.5092 717.7654 728.2704 742.7818 754.8503 784.4715 793.6098 831.3506 855.2183 883.6447 890.9453 931.2144 957.6601 965.5050 979.1881 983.8899 989.9912 994.9590 998.5585 1000.4592 1030.0705 1031.4838 1035.6094 1054.2449 1081.5512 1096.0663 1125.9412 1137.3733 1152.5196 1175.0972 1189.9484 1196.2208 1231.8808 1249.8306 1269.9105 1285.0855 1322.5357 1327.7989 1350.9975 1372.7932 1376.9536 1395.4034 1405.9435 1407.6178 1416.1883 1434.9955 1461.7933 1464.3321 1471.5582 1476.3410 1478.6039 1480.0162 1502.7249 1533.5656 1583.7799 1590.0201 1614.3141 1622.7483 1642.9723 1665.3580 2970.7505 2973.0066 3042.3167 3047.0280 3086.8714 3089.7001 3128.8527 3133.2248 3137.7544 3150.2565 3154.6494 3164.3347 3177.6036 3180.9635 3503.9927 3513.8930
redmass: 10.2090 4.1353 5.2165 4.9803 4.6120 4.8504 7.6166 6.0516 1.1131 4.6544 4.4329 1.8373 2.0754 6.5723 3.5893 4.5807 4.6207 6.3081 5.4832 2.7521 4.5087 8.1613 5.1619 2.8443 3.7392 5.8619 2.9537 4.7521 5.4708 4.6235 4.2770 1.9677 2.6248 1.5764 6.1947 4.9833 4.6223 4.0339 2.8511 5.9852 6.2685 1.8383 3.2324 5.9660 4.2402 2.9753 7.3726 3.6740 1.3589 1.2442 4.5009 1.4465 1.4273 1.4213 3.8240 1.7277 3.8073 5.1544 1.6481 1.6296 1.3756 2.5290 1.4699 2.8024 1.6403 1.7674 2.1729 3.0251 1.8141 3.5029 1.0542 2.0433 1.1426 2.1172 2.6113 2.5095 1.3590 1.4838 4.5695 4.8758 6.7487 6.1980 1.2393 5.5349 1.3294 2.6547 2.3135 1.0503 2.8615 1.4129 1.0529 1.2202 3.4167 2.7436 7.1881 5.9596 7.2013 6.0854 6.3847 9.0702 9.0799 1.0378 1.0384 1.0969 1.0968 1.0984 1.0978 1.0851 1.0901 1.0889 1.0944 1.0922 1.0991 1.0954 1.0969 1.0637 1.0640
irintensity: 1.9263 0.0747 0.1811 0.3375 0.8563 0.5356 1.2251 0.1942 0.0030 0.1594 0.1099 1.0178 1.6506 1.8539 0.2255 1.8299 2.0317 1.0639 2.6558 0.0435 3.3025 1.4288 1.7429 0.0261 3.2755 4.7974 5.0598 3.0829 15.8208 11.6733 2.4365 49.5208 52.1463 124.8632 2.2956 8.6640 46.4392 36.8528 33.1739 19.1654 9.0647 44.0870 0.5503 40.5329 14.3119 44.7228 1.2137 24.1901 31.7569 1.1744 9.0505 18.3909 6.2826 7.1754 56.2723 68.3689 221.2626 0.2763 0.7014 9.1230 2.7722 26.4209 16.0905 143.9888 0.1013 4.5308 5.5061 107.4180 26.0099 84.1412 0.0648 0.3256 2.0397 2.6276 1.3184 7.5143 0.7584 4.2480 79.0130 37.5022 8.0542 0.7591 4.3993 92.9583 14.2007 10.3651 11.4668 0.0983 3.9409 25.7442 28.6244 8.4082 47.3893 79.8094 15.4354 0.2777 2.7374 0.9702 7.6117 144.6724 512.9523 55.3175 14.1757 34.8623 2.0429 32.3523 5.6738 0.4587 21.1508 5.0940 25.1532 4.4349 21.4739 0.7515 4.6012 34.2913 43.1611
temp: 298.150 k
press: 1.00000 atm
elementType: 8 8 8 8 7 7 6 6 6 6 6 6 6 6 6 6 6 6 6 6 6 6 6 6 6 1 1 1 1 1 1 1 1 1 1 1 1 1 1 1 1
symmnumber: 1
zpe: 810593.4 jmol-1
zpe.correction: 0.308739 hartree
zpe.thermalcorrener: 0.331415 hartree
zpe.thermalcorrenthalpy: 0.332359 hartree
zpe.thermalcorrgfe: 0.254842 hartree
zpe.sumelectzpe: -1142.276027 hartree
zpe.sumelectthermal: -1142.253351 hartree
zpe.sumelectthermalent: -1142.252407 hartree
zpe.sumelectthermalfe: -1142.329923 hartree
dipole: 6.2375 2.6596 -0.1598
dipole: 6.7827
quadrupole: -141.8770 -125.3142 -143.4150
quadrupole: -2.7428 3.2095 -5.5911
quadrupole: -5.0083 11.5545 -6.5463 -2.7428 3.2095 -5.5911
hfenergy: -1142.5847659 hartree
pointgroup: C01 [X(C19H16N2O4)]
dipole: 2.4381663 1.0418573 -0.3014826 debye
polarizability: 317.1623944|17.448474|240.9754027|11.8942695|-49.653925|170.9347206 unknown
InChI: InChI=1S/C19H16N2O4/c1-11-8-9-14(10-12(11)2)21-17(13-6-4-3-5-7-13)15(18(22)23)16(20-21)19(24)25/h3-10,22,24H,1-2H3
charge 0 multiplicity 1
41 atoms
O  -3.38119 1.585272 -1.38215
O  -3.177323 -3.463997 1.207619
O  -4.436464 0.694224 0.483028
O  -4.422893 -2.280382 -0.360237
N  -0.138746 -0.83648 0.229999
N  -0.947318 -1.941727 0.477344
C  -0.872716 0.302102 -0.137989
C  1.288802 -1.02096 0.325475
C  -2.226231 -0.108228 -0.132763
C  -0.261392 1.64327 -0.291475
C  3.559813 -0.608632 -0.513745
C  2.163102 -0.409539 -0.600974
C  -2.21577 -1.488365 0.264713
C  4.086332 -1.451373 0.514125
C  1.794374 -1.866562 1.335547
C  3.186528 -2.070712 1.416457
C  0.558824 2.168665 0.74506
C  -0.487407 2.422265 -1.456284
C  4.481681 0.060029 -1.516912
C  5.579806 -1.689945 0.634308
C  -3.441658 0.721189 -0.274537
C  -3.376437 -2.406344 0.316201
C  1.143552 3.44521 0.615086
C  0.105262 3.697405 -1.584852
C  0.92227 4.213189 -0.552605
H  1.759792 0.218475 -1.400827
H  1.103288 -2.359902 2.023947
H  3.583694 -2.726493 2.19969
H  0.727769 1.580687 1.653778
H  -1.130035 2.027668 -2.247405
H  3.915235 0.676024 -2.234959
H  5.216808 0.717796 -1.014611
H  5.063789 -0.684686 -2.093111
H  6.132293 -0.744053 0.794645
H  5.810474 -2.363009 1.476998
H  5.993734 -2.145705 -0.285843
H  1.766568 3.841119 1.424291
H  -0.073699 4.287734 -2.490138
H  1.378403 5.204291 -0.653649
H  -4.216309 2.128542 -1.398448
H  -3.972302 -4.062563 1.165102
