program: Gaussian 09
title: 000176552
version: EM64L-G09RevD.01
frameworkgroup: C1[X(C17H12F4N2O)]
method: RPBEPBE
basis: SDD
operation: Freq
keyword: #p
keyword: freq=noraman
keyword: PBEPBE/SDD
title: #p freq=noraman PBEPBE/SDD
converged: YES YES NO NO
title: Mulliken charges:
elementType: F F F F O N N C C C C C C C C C C C C C C C C C H H H H H H H H H H H H
charge: -0.159456 -0.142834 -0.165529 -0.178602 -0.226245 -0.269071 0.018229 0.312820 0.220176 -0.027112 -0.500206 0.180384 -0.597278 -0.345570 -0.349318 0.182204 0.434980 -0.238509 -0.244973 0.171780 -0.319906 -0.369780 -0.242135 -0.200010 0.259857 0.308092 0.277208 0.241916 0.236015 0.263016 0.238364 0.239728 0.261909 0.256764 0.236003 0.237089
chargesum: 0.00000
title: Mulliken charges with hydrogens summed into heavy atoms:
elementType: F F F F O N N C C C C C C C C C C C C C C C C C
charge: -0.159456 -0.142834 -0.165529 -0.178602 -0.226245 -0.269071 0.018229 0.312820 0.220176 -0.027112 0.067743 0.180384 -0.078154 -0.109555 -0.086302 0.182204 0.434980 -0.000145 -0.005245 0.171780 -0.057996 -0.113016 -0.006132 0.037078
polarizability: 2.39463402e+02 1.77572346e+01 1.67273164e+02 1.49236508e+01 -2.08657521e+01 1.93849974e+02
1716.lowfreq: -4.4655 -0.0006 -0.0005 0.0000 6.1318 8.2591 24.3546 25.1706 33.5317
frequency: 24.2740 25.0750 33.4950 50.6553 64.4696 72.3491 90.3206 121.3762 140.6600 163.5507 182.5125 233.6858 247.0414 271.3354 279.4250 306.7456 312.3538 352.9570 380.4351 392.3367 408.3063 436.1772 445.7807 461.9116 470.1733 480.6099 499.1132 516.3165 528.8388 539.6960 569.1690 583.9658 630.1300 635.3593 666.4844 678.4812 701.6426 739.4948 751.9594 764.1746 770.2295 773.3428 778.2854 796.6020 852.5597 867.1725 874.7718 920.3344 935.6478 950.4863 957.7830 963.8989 985.7462 987.2912 993.3756 1030.0749 1035.6801 1043.5651 1066.8096 1096.5273 1104.7242 1128.0054 1160.2376 1173.2923 1180.5996 1190.2565 1197.0609 1198.9983 1240.7099 1265.3557 1267.5466 1284.0398 1300.6251 1316.9338 1342.0138 1373.9514 1377.8924 1378.4126 1432.2496 1434.2316 1445.1641 1460.8178 1473.7879 1482.5143 1557.5594 1579.2059 1587.6557 1603.8097 1615.5404 1626.4426 2949.1724 3032.4368 3100.9625 3114.1108 3136.5818 3137.2508 3145.0026 3147.9864 3156.7785 3165.4183 3172.7297 3179.5111
redmass: 12.5571 10.1087 7.1814 8.1784 6.9262 5.3415 8.8066 4.9480 5.6750 8.1480 5.2130 8.3020 10.1598 7.5251 6.0850 6.3028 4.0828 6.2842 2.8464 5.4101 5.8470 5.7858 4.4185 5.5451 8.0128 3.4979 4.6721 4.4377 6.1097 4.3492 5.7690 5.4751 5.5098 5.8808 5.0943 5.3903 6.0610 4.7032 3.3308 2.8175 1.5514 5.3728 1.7842 5.0910 2.9054 1.4537 1.4948 3.7882 4.9877 1.5916 1.4297 3.6704 2.7391 1.3354 1.3530 8.7742 2.1747 2.4805 3.9224 2.3559 2.6967 1.8803 1.7838 1.1276 1.0707 1.8985 3.3132 3.4622 1.8933 1.6890 2.5766 1.6946 3.5373 1.2832 1.7687 1.4330 9.1464 7.8976 2.3181 2.3240 1.0876 1.0998 2.5030 2.8277 7.7104 6.7429 7.7702 6.3481 7.2596 9.0172 1.0684 1.0602 1.1017 1.0936 1.0855 1.0867 1.0891 1.0907 1.0947 1.0953 1.1009 1.0994
irintensity: 0.5211 0.5503 0.7494 1.3129 0.8326 0.2563 2.0184 1.7415 0.2506 3.3947 0.5176 0.8803 1.6432 0.9476 0.8702 1.5740 5.8709 1.9661 3.8556 8.7063 3.1340 10.2637 1.5941 0.3787 3.0724 9.1711 0.6282 0.4339 20.7215 16.6371 10.9387 4.0280 3.4191 11.4837 11.7854 7.2622 7.1344 3.9670 20.9882 50.1494 49.2449 7.4400 50.1517 25.2870 9.3776 1.6936 0.8678 34.6983 58.4479 13.4758 2.9493 12.5434 8.6762 0.1508 0.0723 232.7498 7.6474 39.3002 67.2531 12.0263 77.1019 9.4021 3.4865 0.9443 1.2419 49.8940 8.2528 90.2385 20.7988 6.4498 45.2910 25.2606 50.5284 17.6154 52.1438 56.7169 6.6809 11.7492 23.7828 34.2960 50.2125 10.8473 33.8446 43.1885 21.2539 21.8842 23.5642 85.4238 27.1134 307.5447 24.5747 25.2308 3.0529 10.4182 1.4090 0.7107 4.4706 8.7568 19.1393 13.0076 17.3320 10.7104
temp: 298.150 k
press: 1.00000 atm
elementType: 9 9 9 9 8 7 7 6 6 6 6 6 6 6 6 6 6 6 6 6 6 6 6 6 1 1 1 1 1 1 1 1 1 1 1 1
symmnumber: 1
zpe: 670809.5 jmol-1
zpe.correction: 0.255498 hartree
zpe.thermalcorrener: 0.275475 hartree
zpe.thermalcorrenthalpy: 0.276419 hartree
zpe.thermalcorrgfe: 0.204946 hartree
zpe.sumelectzpe: -1237.410734 hartree
zpe.sumelectthermal: -1237.390757 hartree
zpe.sumelectthermalent: -1237.389813 hartree
zpe.sumelectthermalfe: -1237.461286 hartree
dipole: 0.0192 4.7613 -3.9659
dipole: 6.1966
quadrupole: -122.3604 -133.4155 -143.6260
quadrupole: 13.5645 6.2025 1.7517
quadrupole: 10.7735 -0.2815 -10.4920 13.5645 6.2025 1.7517
hfenergy: -1237.6662319 hartree
pointgroup: C01 [X(C17H12F4N2O1)]
dipole: 0.015636 2.4377602 -0.0251739 debye
polarizability: 239.5238189|-4.1939705|199.1018783|22.7960069|16.2580204|161.9608434 unknown
InChI: InChI=1S/C17H12F4N2O/c18-13-7-3-1-5-11(13)16-12-6-2-4-8-14(12)23(10-17(19,20)21)15(24)9-22-16/h1-8H,9-10H2
charge 0 multiplicity 1
36 atoms
F  -3.796826 -0.759261 2.535348
F  -1.798176 -1.649062 1.909323
F  -2.015482 0.592058 2.133011
F  3.640668 -1.103392 -1.535008
O  -2.426442 -2.518911 -1.470164
N  -2.018403 -0.344718 -0.708051
N  0.746309 -1.309034 -1.440702
C  -1.337704 0.922489 -0.836017
C  0.088335 1.007063 -0.80127
C  0.956357 -0.211057 -0.745365
C  -3.145027 -0.479888 0.224847
C  -1.712465 -1.483358 -1.501805
C  -0.436804 -1.349368 -2.336806
C  -2.109892 2.107202 -0.947031
C  0.693675 2.293103 -0.856158
C  2.147336 -0.175024 0.15933
C  -2.682364 -0.578733 1.681209
C  -1.488659 3.368067 -1.013895
C  -0.077325 3.464799 -0.965437
C  3.421606 -0.663285 -0.219493
C  2.017147 0.319699 1.486354
C  4.520828 -0.688829 0.655326
C  3.101545 0.299312 2.387767
C  4.355005 -0.209334 1.973317
H  -3.857284 0.35749 0.157866
H  -3.667995 -1.419891 -0.026343
H  -0.365065 -2.241968 -2.97397
H  -0.511425 -0.441874 -2.975169
H  -3.201975 2.043369 -0.992984
H  1.786076 2.357248 -0.817892
H  -2.10175 4.270669 -1.106501
H  0.412142 4.442594 -1.015343
H  1.042432 0.700225 1.811006
H  5.480405 -1.074323 0.298656
H  2.968109 0.670363 3.408802
H  5.201487 -0.230443 2.667544
