program: Gaussian 09
title: 000176544
version: EM64L-G09RevD.01
frameworkgroup: C1[X(C13H11N3)]
method: RPBEPBE
basis: SDD
operation: Freq
keyword: #pfreq=noraman
keyword: PBEPBE/SDD
title: #p freq=noraman PBEPBE/SDD
converged: YES YES NO NO
title: Mulliken charges:
elementType: N N N C C C C C C C C C C C C C H H H H H H H H H H H
charge: -0.220708 -0.426535 -0.388380 -0.267978 0.290160 0.314495 0.173357 0.250378 -0.394073 -0.374688 -0.362922 -0.365760 -0.245837 -0.207417 -0.243707 -0.217512 0.261093 0.289820 0.299596 0.232520 0.236604 0.246442 0.226287 0.227704 0.227464 0.220588 0.219009
chargesum: 0.00000
title: Mulliken charges with hydrogens summed into heavy atoms:
elementType: N N N C C C C C C C C C C C C C
charge: -0.220708 -0.136716 -0.088784 -0.006885 0.290160 0.314495 0.173357 0.250378 -0.161553 -0.138083 -0.116479 -0.139473 -0.018133 0.020048 -0.023120 0.001497
polarizability: 2.13233134e+02 1.03707800e+01 1.57385881e+02 4.96716803e+00 -5.60205102e-01 9.56235353e+01
1716.lowfreq: -0.0008 -0.0007 -0.0005 5.0454 9.4296 15.5586 32.5482 79.7004 133.2719
frequency: 32.4899 79.6966 133.2698 170.1398 222.2610 265.9417 292.7109 327.0139 365.8508 408.1400 426.8487 470.3715 494.8737 539.3367 546.6294 558.8387 573.2737 594.4714 619.7362 675.8785 684.8347 727.0838 738.2109 748.1047 760.1765 766.9046 834.4862 836.4095 852.1146 868.3838 882.3407 909.2851 934.2174 953.7340 972.9536 975.3466 1007.5901 1015.7324 1022.6201 1048.2901 1097.9705 1110.2630 1163.7387 1165.5037 1168.8640 1183.0376 1226.9411 1255.6597 1262.8848 1275.8734 1282.8710 1317.0945 1347.8704 1360.3964 1402.8746 1424.4137 1449.6049 1458.8684 1469.6866 1484.8523 1598.6805 1613.1342 1616.8469 1626.0870 2974.2744 3120.8170 3127.6542 3133.8883 3141.2885 3152.9868 3153.9315 3167.2613 3169.4191 3469.1414 3569.4035
redmass: 4.9064 4.0171 4.2304 4.3712 1.9047 3.3648 4.4189 2.4288 4.4024 3.0980 3.3445 3.9824 3.0949 4.8557 5.8168 3.8359 4.7728 5.1835 4.8009 5.6976 3.5573 3.8420 1.3387 1.4212 3.0341 4.8868 2.4625 1.5958 1.8319 3.5877 3.6191 1.4013 1.4349 1.2925 3.8310 1.5057 5.1909 2.1019 2.4199 3.7892 1.8318 1.7441 1.4025 1.1745 1.1636 2.4223 1.6908 1.8785 1.8951 2.1908 1.4454 1.3527 1.3188 1.9952 4.2479 3.2392 2.5689 2.5563 2.6772 4.1306 7.0040 6.9286 7.4287 7.6450 1.0868 1.0882 1.0851 1.0881 1.0899 1.0938 1.0948 1.1001 1.0998 1.0775 1.0787
irintensity: 0.8720 3.5146 0.7012 0.3087 81.1628 11.5034 3.3558 107.7011 8.9455 1.7817 12.3099 64.7427 49.6152 11.6006 17.9137 19.5876 3.2162 52.2698 32.0948 22.5596 20.3163 9.7712 68.2478 116.9214 40.2859 2.2218 6.8872 2.8325 3.6815 2.0548 8.9001 5.5396 0.6152 0.0848 1.1447 0.0763 22.5293 6.1313 25.3507 15.8643 18.5470 3.2008 3.4746 2.5712 1.4889 12.0386 18.6452 4.8876 41.0988 34.6394 2.8658 24.5257 29.7285 75.7901 4.5213 0.5181 13.5062 6.1844 29.6977 171.9309 0.3537 4.5530 23.4062 50.5863 57.8974 5.8835 1.8527 7.7320 13.8524 19.1183 33.0256 27.3390 17.9810 12.5310 17.4321
temp: 298.150 k
press: 1.00000 atm
elementType: 7 7 7 6 6 6 6 6 6 6 6 6 6 6 6 6 1 1 1 1 1 1 1 1 1 1 1
symmnumber: 1
zpe: 555549.8 jmol-1
zpe.correction: 0.211598 hartree
zpe.thermalcorrener: 0.223296 hartree
zpe.thermalcorrenthalpy: 0.224240 hartree
zpe.thermalcorrgfe: 0.173486 hartree
zpe.sumelectzpe: -665.095704 hartree
zpe.sumelectthermal: -665.084006 hartree
zpe.sumelectthermalent: -665.083062 hartree
zpe.sumelectthermalfe: -665.133816 hartree
dipole: 2.5286 0.7109 -0.0356
dipole: 2.6269
quadrupole: -88.9232 -77.8140 -96.1744
quadrupole: -0.4760 2.2748 -2.8551
quadrupole: -1.2860 9.8232 -8.5372 -0.4760 2.2748 -2.8551
hfenergy: -665.3073021 hartree
pointgroup: C01 [X(C13H11N3)]
dipole: -0.9955266 0.2774473 -0.0076571 debye
polarizability: 213.2467146|-9.865871|157.1396019|6.023927|-3.5316593|95.8562338 unknown
InChI: InChI=1S/C13H11N3/c1-2-6-10-9(5-1)13-14-11-7-3-4-8-12(11)16(13)15-10/h1-8,13-15H
charge 0 multiplicity 1
27 atoms
N  0.390083 -0.673313 -1.161679
N  0.719183 1.636573 -0.728139
N  -0.552073 -1.626015 -0.55088
C  -0.303154 0.692787 -1.251059
C  -1.574273 0.487381 -0.424373
C  1.602561 -0.46708 -0.398303
C  -1.679347 -0.885916 -0.083428
C  1.787768 0.920331 -0.153246
C  -2.578605 1.394301 -0.049335
C  2.525425 -1.420129 0.047095
C  -2.790231 -1.378244 0.632919
C  2.91806 1.380558 0.549292
C  -3.698463 0.916345 0.678638
C  -3.799009 -0.458272 1.007197
C  3.66818 -0.963375 0.75908
C  3.858873 0.417222 1.000952
H  -0.539118 0.94634 -2.302428
H  0.427211 2.545508 -0.369533
H  -0.743773 -2.411632 -1.183692
H  -2.513071 2.454352 -0.323266
H  2.356938 -2.486667 -0.130849
H  -2.863338 -2.435573 0.906833
H  3.068159 2.446757 0.750888
H  -4.48991 1.609108 0.982969
H  -4.668085 -0.817088 1.570119
H  4.403812 -1.688364 1.122826
H  4.746196 0.754305 1.548501
