program: Gaussian 09
title: 000176542
version: EM64L-G09RevD.01
frameworkgroup: C1[X(C17H13N3)]
method: RPBEPBE
basis: SDD
operation: Freq
keyword: #pfreq=noraman
keyword: PBEPBE/SDD
title: #p freq=noraman PBEPBE/SDD
converged: YES YES NO NO
title: Mulliken charges:
elementType: N N N C C C C C C C C C C C C C C C C C H H H H H H H H H H H H H
charge: -0.218645 -0.418951 -0.375107 -0.302174 0.102997 0.344636 0.261749 0.169182 0.267323 -0.381493 0.436317 -0.397453 -0.372168 -0.455325 -0.412983 -0.252574 -0.204903 -0.438890 -0.247935 -0.253427 0.261187 0.287044 0.294708 0.229648 0.234373 0.241489 0.235383 0.230060 0.226205 0.225260 0.237770 0.222451 0.224246
chargesum: 0.00000
title: Mulliken charges with hydrogens summed into heavy atoms:
elementType: N N N C C C C C C C C C C C C C C C C C
charge: -0.218645 -0.131907 -0.080398 -0.040986 0.102997 0.344636 0.261749 0.169182 0.267323 -0.151845 0.436317 -0.163080 -0.130680 -0.219942 -0.182924 -0.026369 0.020357 -0.201120 -0.025484 -0.029181
polarizability: 3.22105514e+02 2.62042524e+01 2.11661630e+02 7.13160011e+00 -2.12390317e+00 1.06640706e+02
1716.lowfreq: -8.2968 -2.1153 -0.0007 -0.0007 -0.0006 5.4911 25.7815 53.8099 82.4221
frequency: 25.7174 53.8065 82.4199 127.7623 143.4740 153.0703 201.4415 208.4323 258.7170 283.6974 331.2330 377.6247 409.3596 429.2506 439.8981 454.0105 504.5606 514.3029 516.7793 555.7359 562.3068 582.2774 593.3087 614.1010 655.0284 673.3032 692.8705 717.0946 737.1110 746.5062 750.1978 752.0320 787.8698 810.6559 826.5654 845.8192 864.8011 868.5398 888.2020 910.7637 931.3472 935.9864 955.5958 959.7920 969.9413 981.8499 990.6170 1012.1580 1020.7770 1041.3599 1075.0556 1112.7042 1145.7727 1164.3410 1169.3699 1173.7882 1186.7577 1207.5755 1230.4488 1256.8666 1267.3171 1271.6630 1281.7185 1310.4643 1338.5940 1366.6082 1388.2543 1404.7732 1406.4504 1428.8604 1451.3702 1455.7090 1472.2625 1480.3762 1534.8928 1586.2088 1597.6830 1602.0333 1623.9633 1642.4771 2951.3797 3117.4707 3124.6902 3125.5610 3126.7363 3133.4226 3143.3268 3152.2218 3152.5268 3161.1279 3167.5655 3475.6679 3616.1783
redmass: 4.8858 3.6849 4.8141 1.5745 2.9216 6.1961 4.6840 2.7961 3.9221 5.4237 5.1720 4.4748 3.4579 3.5639 3.8005 3.9648 4.9997 3.7373 4.1694 3.6797 4.1063 4.1660 5.0269 6.0890 4.2359 4.8518 4.3522 4.3738 3.6211 1.4735 1.3383 4.3513 3.2663 1.4734 3.3536 1.5866 3.0906 1.9765 3.7630 5.6693 1.4384 1.3335 5.2063 1.4096 1.3089 1.3312 5.1644 3.3065 2.1005 2.8960 2.9928 1.6570 1.2837 1.3960 1.0880 1.2940 1.5589 1.9159 1.6999 1.5633 1.7765 1.5402 1.9761 1.7495 1.4052 2.6014 1.7021 5.9402 4.5587 3.4301 3.0463 2.7886 3.2541 3.2526 4.8508 7.2136 6.2030 6.9334 7.3238 7.7642 1.0868 1.0861 1.0873 1.0875 1.0871 1.0888 1.0946 1.0941 1.0970 1.1003 1.1001 1.0778 1.0799
irintensity: 1.4964 21.0840 2.3737 101.6697 21.0952 6.8944 0.8524 24.5447 18.1249 0.9298 2.6652 2.0073 0.8998 9.8365 20.1274 48.5823 8.6252 2.0412 24.0659 50.0709 22.0672 40.7178 14.7582 16.9730 8.6423 22.8695 9.7378 31.7879 3.7503 84.5266 40.9850 13.1178 8.6195 95.5903 0.1601 4.2131 13.0918 11.9186 3.7817 25.2749 1.3546 0.9937 26.8362 4.0911 0.0485 0.1403 22.7697 39.4016 9.3714 21.3713 9.6736 6.7141 3.9759 4.4557 2.6578 3.6170 38.5105 11.3807 7.9067 9.4681 12.3363 76.7491 19.7518 32.7896 47.3571 125.4151 1.8675 17.7689 4.8913 2.0550 1.3631 27.1165 9.5345 102.8989 44.4740 10.2974 22.5818 27.7044 72.8837 93.3497 68.0030 4.9831 4.4440 4.2434 4.9505 9.2971 38.3339 19.3544 29.9581 36.4283 29.5638 11.2348 58.1873
temp: 298.150 k
press: 1.00000 atm
elementType: 7 7 7 6 6 6 6 6 6 6 6 6 6 6 6 6 6 6 6 6 1 1 1 1 1 1 1 1 1 1 1 1 1
symmnumber: 1
zpe: 674887.1 jmol-1
zpe.correction: 0.257051 hartree
zpe.thermalcorrener: 0.271807 hartree
zpe.thermalcorrenthalpy: 0.272752 hartree
zpe.thermalcorrgfe: 0.214779 hartree
zpe.sumelectzpe: -818.480699 hartree
zpe.sumelectthermal: -818.465942 hartree
zpe.sumelectthermalent: -818.464998 hartree
zpe.sumelectthermalfe: -818.522970 hartree
dipole: 1.6756 1.0355 0.4664
dipole: 2.0243
quadrupole: -104.9491 -96.0301 -121.0300
quadrupole: 2.1906 3.1292 0.9049
quadrupole: 2.3873 11.3063 -13.6936 2.1906 3.1292 0.9049
hfenergy: -818.7377495 hartree
pointgroup: C01 [X(C17H13N3)]
dipole: -0.6592817 -0.4105276 0.1762836 debye
polarizability: 322.0675911|26.4585115|211.6951531|-5.94364|3.3619748|106.6451052 unknown
InChI: InChI=1S/C17H13N3/c1-2-6-12-11(5-1)9-10-15-16(12)20-17(18-15)13-7-3-4-8-14(13)19-20/h1-10,17-19H
charge 0 multiplicity 1
33 atoms
N  -0.418164 0.280164 0.879476
N  -0.782025 -1.98243 0.250018
N  -1.029976 1.293175 -0.051235
C  -1.428829 -0.860215 0.999457
C  0.791522 -0.320754 0.342869
C  -2.690658 -0.297326 0.376683
C  0.550185 -1.660347 -0.019925
C  -2.391822 0.956596 -0.217196
C  2.062765 0.288887 0.190322
C  1.581562 -2.460753 -0.591908
C  3.120073 -0.525175 -0.394666
C  -3.988125 -0.829432 0.316569
C  -3.39281 1.702699 -0.880206
C  2.843823 -1.882234 -0.771825
C  2.359563 1.636689 0.584811
C  -5.001816 -0.094134 -0.348067
C  -4.697159 1.159024 -0.936936
C  4.416637 0.057882 -0.576994
C  3.638026 2.166237 0.398913
C  4.675649 1.376587 -0.195165
H  -1.559212 -1.148109 2.062601
H  -1.159782 -2.926207 0.258754
H  -0.819257 2.242891 0.27701
H  1.388244 -3.494833 -0.895714
H  -4.222696 -1.793287 0.78369
H  -3.166204 2.666489 -1.347474
H  3.652801 -2.476994 -1.212268
H  1.576512 2.236507 1.061693
H  -6.021066 -0.489879 -0.402437
H  -5.486479 1.720522 -1.449691
H  5.210534 -0.553952 -1.022803
H  3.856386 3.192946 0.713947
H  5.671299 1.809368 -0.340505
