program: Gaussian 09
title: 000176519
version: EM64L-G09RevD.01
frameworkgroup: C1[X(C10H8Cl3NO2)]
method: RPBEPBE
basis: SDD
operation: Freq
keyword: #p
keyword: freq=noraman
keyword: PBEPBE/SDD
title: #p freq=noraman PBEPBE/SDD
converged: YES YES NO NO
title: Mulliken charges:
elementType: Cl Cl Cl O O N C C C C C C C C C C H H H H H H H H
charge: 0.062492 0.118505 0.165083 -0.220688 -0.187087 -0.421571 0.507459 0.318080 -0.460560 -0.342749 -0.319823 -0.354434 0.122429 0.417875 -0.789454 -0.749076 0.230576 0.307629 0.246946 0.282966 0.325490 0.237958 0.237459 0.264495
chargesum: 0.00000
title: Mulliken charges with hydrogens summed into heavy atoms:
elementType: Cl Cl Cl O O N C C C C C C C C C C
charge: 0.062492 0.118505 0.165083 -0.220688 -0.187087 -0.096081 0.507459 0.318080 -0.229984 -0.035120 -0.072877 -0.071468 0.122429 0.417875 -0.049542 -0.749076
polarizability: 2.58882479e+02 6.14130361e+00 1.50504415e+02 3.24490290e+00 1.41501286e-01 9.15912997e+01
1716.lowfreq: -7.3456 -6.0655 -0.7717 -0.0037 -0.0033 -0.0025 13.3346 31.5095 52.5467
frequency: 12.3899 31.5061 52.4949 75.6918 76.8896 118.7616 154.6514 160.4528 172.8573 187.6860 212.9099 256.4859 271.5692 309.2155 315.7665 352.6769 376.4709 383.9733 409.7186 465.3845 500.2643 558.2700 593.2348 603.5813 628.1578 661.1938 709.4252 726.2325 743.9572 751.2014 766.9747 832.9833 856.1957 882.0187 937.3784 947.8148 959.6260 1004.6900 1012.3729 1030.0095 1074.3092 1129.5883 1161.8352 1193.1755 1264.3610 1277.2827 1308.3623 1367.7905 1376.8199 1422.0791 1449.1555 1464.6249 1502.2166 1514.1988 1575.2934 1603.1486 1622.4294 1637.8730 2985.2087 3069.3533 3119.3569 3126.8564 3156.4696 3161.1435 3200.2694 3475.8609
redmass: 8.3894 10.3300 4.7124 7.0986 5.8408 7.2135 12.5084 1.0300 8.6276 12.4164 7.6511 19.0312 13.2392 9.9944 5.9753 7.6212 10.6825 6.7578 2.9252 4.5346 3.1146 5.3754 2.4398 6.9016 7.0690 5.6260 1.6242 3.6367 3.5310 6.5419 10.0621 1.4208 6.3288 1.3917 7.2736 2.3853 1.3783 3.0792 1.3976 1.7269 2.4438 1.3332 3.9859 1.1416 2.1594 4.2917 1.3351 1.9105 2.1490 4.1901 1.0985 1.0495 2.3489 2.2543 4.9109 5.1557 6.5961 9.2128 1.0377 1.0969 1.0899 1.0990 1.0910 1.0944 1.0948 1.0766
irintensity: 2.3372 1.2878 0.1175 1.9947 3.6667 1.9503 0.7368 0.5279 2.3635 0.4157 6.3668 0.5650 7.2451 2.2963 0.5436 0.6925 5.2629 15.2085 0.0376 10.5040 19.7659 2.3250 39.0140 67.6831 0.9754 83.8608 56.9389 108.5647 10.4148 23.3243 84.0738 57.3723 41.0747 59.4400 1.8068 44.3916 0.5563 3.5992 0.0346 1.5217 0.9628 17.8082 11.9864 63.9053 13.2488 318.5003 3.3488 32.6151 197.8215 46.3139 26.4393 21.4288 2.8842 256.2465 295.3774 52.5233 121.1550 145.9522 3.5307 12.4576 14.2234 15.2115 3.3652 7.3561 1.9402 62.9278
temp: 298.150 k
press: 1.00000 atm
elementType: 17 17 17 8 8 7 6 6 6 6 6 6 6 6 6 6 1 1 1 1 1 1 1 1
symmnumber: 1
zpe: 420739.8 jmol-1
zpe.correction: 0.160251 hartree
zpe.thermalcorrener: 0.176367 hartree
zpe.thermalcorrenthalpy: 0.177311 hartree
zpe.thermalcorrgfe: 0.113438 hartree
zpe.sumelectzpe: -1970.083661 hartree
zpe.sumelectthermal: -1970.067545 hartree
zpe.sumelectthermalent: -1970.066601 hartree
zpe.sumelectthermalfe: -1970.130474 hartree
dipole: 0.1550 5.3596 -0.0692
dipole: 5.3623
quadrupole: -126.7064 -112.8802 -114.6073
quadrupole: 14.8510 0.5303 -0.0493
quadrupole: -8.6418 5.1844 3.4573 14.8510 0.5303 -0.0493
hfenergy: -1970.243912 hartree
pointgroup: C01 [X(C10H8Cl3N1O2)]
dipole: -0.087456 2.0905472 0.269784 debye
dipolederiv: -0.356152 -0.0112526 -0.0130327 -0.1595993 -0.6768441 -0.3192781 -0.0799881 -0.2909697 -0.33394 -0.3662588 -0.0244313 0.129922 -0.0697825 -0.1374047 0.125107 0.2674606 0.1037235 -0.749412 -0.4596046 0.2609259 -0.1883378 0.3013663 -0.3229666 0.1741022 -0.1760809 0.1667921 -0.2147365 -1.0172504 -0.1276233 -0.0217177 -0.4644784 -0.7473079 -0.0503693 -0.0630117 -0.0483905 -0.3195173 -0.6134961 -0.1644772 -0.0043489 0.6261925 -0.8265105 -0.0213223 0.1230166 -0.0485278 -0.2717094 -1.9215341 0.2121402 0.0231466 0.357151 -0.4281804 -0.0336406 0.0030616 0.0025924 -0.2605854 1.2946094 -0.0136032 0.0110411 0.1844128 0.1215385 -0.0009833 0.04657 -0.0006418 0.1176441 -1.1005259 0.0042861 -0.0103257 0.0672111 -0.1432375 -0.0128141 -0.0113509 -0.013805 -0.0193069 -0.4484038 0.0761989 0.0060215 0.2364167 0.0250464 0.0271964 0.0165665 0.025454 -0.1839946 -0.3652724 -0.1049519 -0.0104727 -0.2422067 -0.1004386 0.0020693 -0.0255914 0.0023095 -0.1514599 0.2573198 -0.0479747 0.001767 0.0772585 0.0669769 0.0229144 0.0139915 0.0197106 -0.1184556 0.1916205 0.097368 0.0147232 -0.0839499 0.0866347 0.0174729 -0.0037094 0.0211106 -0.0895893 2.079896 -0.0246088 0.0224201 0.0879613 0.8939906 0.0806299 0.0459368 0.0810465 0.133018 1.4894794 0.0318376 -0.0615089 -1.0411713 0.956182 0.0464934 -0.325373 0.048591 0.054858 -0.2937049 0.1985228 0.0159856 0.3681981 -0.3265384 -0.0337638 0.0316729 -0.0354975 0.0484371 0.9443043 -0.3277262 0.0866269 -0.2331603 1.1722906 0.0406111 0.1025702 0.0396865 1.3888126 0.0152928 -0.1016206 -0.0146879 -0.0965526 -0.0375327 -0.0233502 -0.0121008 -0.0255983 0.1603362 0.1241401 0.0582386 0.0036808 0.0414043 0.0813718 -0.0103884 0.0031741 -0.0086279 0.1755948 0.0373654 0.0907022 0.0088077 0.1042908 -0.0144127 -0.0158794 0.0104418 -0.0155622 0.1388737 0.104947 -0.0553849 -0.0068916 -0.0170269 0.0250569 -0.0136998 -0.0040921 -0.0140822 0.1455967 0.3383314 0.0371308 0.0140808 0.0684352 0.1637308 -0.0083126 0.0482732 -0.0170592 0.2718831 0.0840044 -0.0348201 0.0741225 -0.0196719 0.0231251 0.0839384 0.0435377 0.0962394 -0.0027706 0.0884736 -0.016499 -0.0764281 -0.0081039 0.0580906 -0.0717525 -0.0425608 -0.0844233 -0.0417257 -0.1075811 -0.0123774 -0.0045938 -0.0845948 0.0873393 -0.0049805 -0.0124142 -0.0040707 0.1221489 unknown
polarizability: 259.0376594|-5.0597404|149.6084379|2.1851347|6.6352059|92.3320966 unknown
InChI: InChI=1S/C10H8Cl3NO2/c1-6(15)7-2-4-8(5-3-7)14-9(16)10(11,12)13/h2-5,14H,1H3
charge 0 multiplicity 1
24 atoms
Cl 3.976021 1.787682 0.888792
Cl 4.262955 0.455136 -1.832665
Cl 5.045871 -1.036088 0.686394
O  -4.827165 -1.347424 -0.207027
O  2.238631 -1.70952 -0.107985
N  1.391031 0.478591 0.095454
C  -0.014706 0.263177 0.049946
C  -2.84443 0.005557 -0.027513
C  -0.843223 1.412772 0.164097
C  -0.602173 -1.023055 -0.10359
C  -2.241307 1.283033 0.125237
C  -2.002175 -1.133552 -0.140107
C  -4.334089 -0.188564 -0.07486
C  2.391354 -0.466961 0.002793
C  -5.24024 1.033596 0.037509
C  3.839852 0.136043 -0.039275
H  -0.389382 2.404815 0.281658
H  0.033947 -1.905273 -0.18868
H  -2.860138 2.181417 0.213955
H  -2.47943 -2.112199 -0.256924
H  1.694412 1.448982 0.233091
H  -5.045399 1.750286 -0.782168
H  -5.074786 1.56709 0.992237
H  -6.289531 0.70666 -0.013671
