program: Gaussian 09
title: 000176526
version: EM64L-G09RevD.01
frameworkgroup: C1[X(C11H7BrCl2N2O3)]
method: RPBEPBE
basis: SDD
operation: Freq
keyword: #p
keyword: freq=noraman
keyword: PBEPBE/SDD
title: #p freq=noraman PBEPBE/SDD
converged: YES YES NO NO
title: Mulliken charges:
elementType: Br Cl Cl O O O N N C C C C C C C C C C C H H H H H H H
charge: 0.039999 -0.033747 -0.032050 -0.172183 -0.206051 -0.209104 -0.360004 -0.210080 -0.470762 0.179675 0.313384 0.525550 0.313227 -0.317185 -0.316951 -0.793954 -0.073650 -0.077080 -0.248034 0.298650 0.300068 0.305265 0.302786 0.334116 0.320081 0.288035
chargesum: 0.00000
title: Mulliken charges with hydrogens summed into heavy atoms:
elementType: Br Cl Cl O O O N N C C C C C C C C C C C
charge: 0.039999 -0.033747 -0.032050 -0.172183 -0.206051 -0.209104 -0.360004 -0.210080 0.127957 0.179675 0.313384 0.525550 0.313227 -0.011920 -0.014165 -0.139757 -0.073650 -0.077080 0.040001
polarizability: 2.31867359e+02 -8.30007589e+00 1.86667930e+02 -2.18880457e+01 -1.04194757e+01 1.20407242e+02
1716.lowfreq: -5.9829 -0.0013 -0.0012 -0.0011 1.7791 3.5874 15.3143 23.3611 41.7294
frequency: 15.2440 23.3591 41.7283 55.2106 74.3175 115.6015 128.5840 135.6679 154.7382 161.9566 195.4119 199.5902 256.5207 265.1589 266.6242 305.0289 356.4482 379.7342 385.4181 412.9393 449.3169 486.3279 510.0712 512.6672 540.2825 577.9234 588.7895 615.7020 660.6120 690.9489 712.9680 730.3801 744.7417 760.3679 849.6399 863.9732 871.0723 876.7026 897.5816 978.1732 987.6008 991.9896 1038.2818 1090.2398 1110.2879 1116.3007 1153.1729 1170.3520 1171.1171 1200.5954 1237.1408 1268.8571 1292.5960 1338.5339 1340.4356 1376.0419 1421.0234 1422.2634 1445.0603 1452.3652 1568.7483 1598.1276 1601.4878 1658.6481 1709.2890 3029.3767 3083.9651 3085.5362 3182.0291 3188.1607 3207.8596 3209.3941
redmass: 17.4183 21.3304 15.2552 14.4897 9.4390 4.8515 12.1242 11.5571 16.1189 7.9605 5.0672 4.9668 7.7186 4.7340 8.4931 7.1729 4.5714 6.8384 9.2243 8.5605 5.2925 7.0296 5.6165 6.4685 3.9344 5.4879 4.4900 7.7096 2.5518 4.3839 9.1345 7.3246 7.4615 10.6236 4.3369 1.6242 1.3866 1.5250 1.9069 6.8087 2.0019 6.0302 3.0813 2.1963 1.7239 1.8983 2.3322 2.4862 1.2996 5.8542 1.1579 1.2172 2.7450 2.8476 4.3112 10.4542 1.3511 2.1213 2.8924 1.1601 7.4649 7.5300 9.7347 11.3941 12.4294 1.0598 1.0557 1.1037 1.1125 1.0942 1.0929 1.0939
irintensity: 0.0736 0.2510 0.2765 0.0460 0.2141 7.6913 6.9317 1.2531 0.6015 0.1077 4.1685 3.8280 2.0679 1.7710 3.7025 1.0062 13.7092 1.6729 17.6021 8.5745 0.8376 13.9504 3.9895 8.3211 0.0487 64.2448 0.4144 24.1389 22.5814 37.3280 5.7588 13.6481 12.9769 80.1654 26.2163 35.9119 0.2339 10.3985 0.3970 9.8606 1.3074 3.1793 53.6873 79.7699 14.1147 6.0757 199.9169 63.0930 19.5733 173.6241 10.4130 5.8380 379.9619 397.2813 152.0800 1.6383 152.4847 25.9263 122.4924 14.9865 97.9626 243.6397 86.1805 558.5376 21.3108 4.7227 6.9753 0.3060 1.5749 2.2333 7.1461 2.6003
temp: 298.150 k
press: 1.00000 atm
elementType: 35 17 17 8 8 8 7 7 6 6 6 6 6 6 6 6 6 6 6 1 1 1 1 1 1 1
symmnumber: 1
zpe: 434210.9 jmol-1
zpe.correction: 0.165382 hartree
zpe.thermalcorrener: 0.183007 hartree
zpe.thermalcorrenthalpy: 0.183951 hartree
zpe.thermalcorrgfe: 0.115717 hartree
zpe.sumelectzpe: -1690.803433 hartree
zpe.sumelectthermal: -1690.785808 hartree
zpe.sumelectthermalent: -1690.784864 hartree
zpe.sumelectthermalfe: -1690.853098 hartree
dipole: 0.3732 0.1768 -1.2630
dipole: 1.3288
quadrupole: -143.9499 -141.8644 -130.2877
quadrupole: -0.6122 -3.8505 -3.7889
quadrupole: -5.2492 -3.1637 8.4129 -0.6122 -3.8505 -3.7889
hfenergy: -1690.9688149 hartree
pointgroup: C01 [X(C11H7Br1Cl2N2O3)]
dipole: 0.1898986 -0.0861017 0.4794005 debye
dipolederiv: -0.1028792 0.0357662 0.0123829 0.0772875 -0.1659217 -0.0502783 0.0867769 -0.119505 -0.3044633 -0.2156825 -0.1911499 0.0611489 -0.2518048 -0.6321506 0.2374914 0.0878098 0.2324075 -0.1501244 -0.4566321 0.2590946 -0.1952883 0.3048679 -0.3591522 0.2048545 -0.2312649 0.1977171 -0.1876447 -0.586189 0.3461645 0.0847351 0.0866551 -1.0227226 -0.1400309 -0.0300598 -0.090755 -0.3105962 -0.7301879 0.0270235 0.0294921 0.0336694 -1.0231611 -0.1065601 0.0025258 -0.0570805 -0.2754578 -1.1691981 -0.0252878 -0.0555485 -0.3606883 -0.5684938 -0.2192244 -0.1282209 -0.0634323 -0.3368241 -1.4845942 0.0034185 -0.0075506 0.3090981 -1.3752745 -0.1667432 -0.0543495 -0.1286423 -0.1582413 -2.2871192 -0.0289131 0.0828752 0.0054543 -0.5642801 -0.1238732 -0.0596077 -0.0768514 -0.2045254 -0.2938785 -0.0514683 -0.013624 -0.1199622 0.2996173 0.0323081 -0.0587937 0.0233701 0.2481817 0.8180583 -0.034016 -0.0079855 0.1395377 1.8115578 0.3015719 -0.0058078 0.194233 0.2237831 2.3143458 -0.2575562 -0.125671 -0.1956275 1.4700392 0.1650867 0.1526977 0.1241522 0.2876493 1.0760421 0.2145001 0.0799057 0.2618297 0.2253706 -0.1427505 0.1119734 -0.1043944 0.1620815 2.3390098 -0.1537592 -0.0928017 -0.3047868 0.7788221 0.4889966 0.0096557 0.2139859 0.2343237 -0.4795293 0.1216916 -0.1015924 0.1140866 -0.1589754 0.0719105 -0.0834722 0.1039707 -0.1540801 -0.3140388 -0.1987788 0.0372965 -0.2114092 -0.3403576 0.0863562 0.0011427 0.0989532 -0.1444472 -0.0131473 0.0279611 0.0340036 0.0275166 -0.1231121 -0.0607092 -0.0379918 -0.0079745 0.4378024 0.3985943 0.3201761 -0.0513071 0.4196177 1.000213 -0.431676 -0.1375837 -0.4135654 0.1326639 0.7708786 -0.39108 0.3235385 -0.4589035 0.5714367 -0.3892808 0.4121437 -0.3473611 0.1942657 -0.250047 0.0445125 -0.0499768 0.0389542 -0.4311518 0.1955521 -0.05545 0.1757694 -0.1723618 0.0641168 -0.0149435 0.0333884 0.0542824 0.0512128 0.0192947 0.0392947 0.0465723 0.041784 0.0935508 0.0004325 -0.0281918 0.0514602 0.0647555 -0.0158158 -0.011921 -0.0424167 0.0220817 0.1547298 -0.0291014 0.0029405 -0.0211925 0.0795313 0.0437936 0.0224552 0.0158382 0.1506339 0.1461523 0.0435601 -0.0374618 0.0431258 0.1083835 0.0365852 -0.0438039 0.0127518 0.1475771 0.1759142 -0.1049606 0.0206668 -0.0228618 0.0889917 -0.0204235 0.065841 0.0103748 -0.0161362 -0.0062207 0.0603488 -0.0190694 0.0038846 0.0991949 -0.0392663 -0.0386458 -0.0129289 -0.0310975 0.037951 -0.0236356 -0.0163052 -0.0240912 0.115627 0.022831 -0.0153441 0.0148116 0.1631722 unknown
polarizability: 236.1492108|2.1648969|185.5531333|8.6085381|-12.6316054|117.240187 unknown
InChI: InChI=1S/C11H7BrCl2N2O3/c12-4-9(17)15-5-10(18)16(11(15)19)8-2-6(13)1-7(14)3-8/h1-3H,4-5H2
charge 0 multiplicity 1
26 atoms
Br 4.053658 -1.706667 -2.09804
Cl -3.613305 -3.07567 1.093886
Cl -4.712817 1.7608 -1.39419
O  -0.130804 2.876358 0.484446
O  1.122058 -1.656447 0.025407
O  4.649193 0.758141 0.536853
N  0.115934 0.512206 0.205043
N  2.393889 0.354822 0.285899
C  2.09572 1.786448 0.477987
C  0.574231 1.850952 0.394948
C  1.209946 -0.41792 0.152019
C  -1.266325 0.12327 0.087817
C  3.744305 -0.077662 0.274994
C  -2.182848 1.015933 -0.52228
C  -1.695519 -1.130305 0.590552
C  4.043298 -1.521463 -0.078916
C  -3.053414 -1.467568 0.4597
C  -3.529339 0.624752 -0.614347
C  -4.000692 -0.612731 -0.135497
H  2.56745 2.404566 -0.305109
H  2.455238 2.153104 1.455051
H  -1.860802 1.98796 -0.896863
H  -0.992438 -1.82707 1.047352
H  3.284689 -2.235015 0.266774
H  5.061761 -1.766547 0.247747
H  -5.051965 -0.896145 -0.221632
