program: Gaussian 09
title: 000176518
version: EM64L-G09RevD.01
frameworkgroup: C1[X(C15H14O4)]
method: RPBEPBE
basis: SDD
operation: Freq
keyword: #pfreq=noraman
keyword: PBEPBE/SDD
title: #p freq=noraman PBEPBE/SDD
converged: NO NO NO NO
title: Mulliken charges:
elementType: O O O O C C C C C C C C C C C C C C C H H H H H H H H H H H H H H
charge: -0.251437 -0.175241 -0.113384 -0.369912 0.217880 -0.081998 0.054854 0.097637 -0.740566 -0.739635 -0.713498 0.426758 -0.159233 0.139108 -0.145923 -0.437034 0.189493 -0.202168 -0.420375 0.235893 0.214799 0.266688 0.204804 0.259431 0.220006 0.214409 0.239938 0.235594 0.221140 0.283984 0.240125 0.226302 0.361562
chargesum: 0.00000
title: Mulliken charges with hydrogens summed into heavy atoms:
elementType: O O O O C C C C C C C C C C C C C C C
charge: -0.251437 -0.175241 -0.113384 -0.008350 0.217880 0.153895 0.054854 0.097637 -0.054275 -0.045790 -0.016825 0.426758 -0.159233 0.139108 -0.145923 -0.153050 0.189493 0.037957 -0.194073
polarizability: 2.47285586e+02 1.57115510e+01 2.10941864e+02 -2.59017394e+00 1.65380026e+00 9.37183348e+01
1716.lowfreq: -14.0517 -7.1264 -1.8487 0.0002 0.0003 0.0005 32.3416 53.7821 61.7451
frequency: 32.1739 53.7331 61.7411 95.4414 143.5604 157.7038 194.7821 199.6403 212.4826 235.9176 239.2533 262.9187 265.3414 272.2073 294.4968 333.4831 355.4359 375.3884 401.8615 413.4007 424.8811 426.9320 431.6848 468.9079 527.0411 543.9975 555.5886 577.8681 590.6933 638.0213 692.8610 706.0943 713.5432 741.5396 782.5553 793.6475 836.6399 861.3855 871.2376 895.2106 896.7717 938.2713 955.5792 980.5868 993.8552 997.7351 1027.4254 1057.2900 1074.6214 1116.3308 1133.0755 1169.5290 1176.9869 1189.0466 1194.7035 1218.7799 1237.4145 1258.7619 1296.9473 1319.8827 1344.0579 1374.6660 1377.4656 1391.7034 1394.3434 1401.4009 1450.4656 1454.7298 1460.5299 1470.7067 1476.5275 1479.0552 1483.7642 1494.8843 1546.2949 1567.9739 1581.9630 1611.9990 1624.3085 2978.2937 2981.4323 2995.6863 3000.1587 3069.4289 3076.4926 3089.9692 3093.1835 3101.0415 3110.7169 3116.6892 3156.0634 3180.2661 3537.2015
redmass: 5.2557 4.8792 5.6089 5.1800 3.9673 3.8286 2.9556 1.1496 1.2068 4.8972 3.5746 2.9924 2.6286 1.2657 2.9572 3.9882 11.3484 4.6974 3.5472 5.1782 1.8739 2.8462 4.0270 4.4535 4.0526 4.9922 4.1083 4.9092 5.0489 5.9018 6.4467 7.3590 2.6794 3.3575 4.3812 1.7981 6.0026 7.3202 4.7453 4.0570 1.4766 1.5847 2.1807 1.3498 2.8898 1.5329 1.6233 1.6698 2.1909 2.3258 2.2931 1.6756 1.6002 2.8895 2.4614 2.7254 2.3112 2.4516 1.6317 3.1714 1.6893 1.6987 1.7821 1.3656 3.2138 1.4703 2.7459 1.0474 1.0474 1.1028 1.7452 1.4554 1.0680 1.0617 10.7285 8.7557 6.9299 8.2294 10.1393 1.0366 1.0364 1.0601 1.0610 1.0999 1.0999 1.0981 1.1000 1.0986 1.1002 1.0895 1.0918 1.0972 1.0657
irintensity: 2.0105 2.1275 0.5083 0.6679 3.6820 3.6851 0.3652 0.3423 0.0189 0.8427 1.9291 0.8230 0.5065 0.5095 1.7822 5.7459 0.5396 4.6854 22.3725 9.8727 73.6963 17.0847 19.4445 3.4161 2.4609 0.7052 8.6211 5.7319 5.8753 6.2273 5.9853 5.9408 19.6239 1.0637 11.2132 64.1688 50.4044 0.1412 27.2348 37.6597 2.2270 3.4376 24.6880 1.1400 92.9621 10.1334 47.0702 15.0069 14.9916 16.6065 1.1300 56.2404 5.6020 32.5729 31.3636 62.7439 128.1800 50.9601 35.1164 37.9652 7.1092 56.5693 76.8542 25.8329 35.1017 11.0553 10.6710 3.6725 9.6876 31.2905 10.1749 16.8534 10.2871 16.1314 261.1891 24.7807 158.2714 43.2573 37.7558 29.0195 31.8233 20.8074 30.3769 25.2096 44.3040 21.7233 6.4472 9.2476 24.3366 10.6175 15.5891 4.6140 40.3333
temp: 298.150 k
press: 1.00000 atm
elementType: 8 8 8 8 6 6 6 6 6 6 6 6 6 6 6 6 6 6 6 1 1 1 1 1 1 1 1 1 1 1 1 1 1
symmnumber: 1
zpe: 666250.3 jmol-1
zpe.correction: 0.253761 hartree
zpe.thermalcorrener: 0.270945 hartree
zpe.thermalcorrenthalpy: 0.271889 hartree
zpe.thermalcorrgfe: 0.209499 hartree
zpe.sumelectzpe: -879.511149 hartree
zpe.sumelectthermal: -879.493965 hartree
zpe.sumelectthermalent: -879.493021 hartree
zpe.sumelectthermalfe: -879.555412 hartree
dipole: -0.2790 -7.4007 -0.1496
dipole: 7.4075
quadrupole: -76.2859 -127.5776 -110.4685
quadrupole: 8.2882 -1.9147 -0.0310
quadrupole: 28.4914 -22.8003 -5.6911 8.2882 -1.9147 -0.0310
hfenergy: -879.7649101 hartree
pointgroup: C01 [X(C15H14O4)]
dipole: 0.1528129 -2.9094101 0.0724637 debye
polarizability: 247.7234977|-15.189045|210.4683388|-2.959004|-2.2101655|93.7539481 unknown
InChI: InChI=1S/C15H14O4/c1-7-15(2,3)11-13(18)12(17)10-8(14(11)19-7)5-4-6-9(10)16/h4-7,16H,1-3H3
charge 0 multiplicity 1
33 atoms
O  -1.405599 -1.804707 0.177753
O  -0.967395 2.887155 -0.129213
O  1.806643 2.672834 0.0504
O  4.001301 1.116719 -0.10667
C  -2.706616 0.302651 0.053109
C  -2.801243 -1.219791 0.450498
C  -1.187973 0.504428 0.101957
C  -0.547079 -0.715595 0.122837
C  -3.470945 1.178916 1.075208
C  -3.210423 0.603949 -1.386276
C  -3.82383 -2.103577 -0.248781
C  0.896879 -0.926449 0.060505
C  -0.437867 1.735842 -0.01423
C  1.737533 0.238374 0.007916
C  1.12926 1.611253 0.02141
C  1.428723 -2.234123 0.056892
C  3.147598 0.020945 -0.051078
C  2.827947 -2.414409 -0.005617
C  3.680511 -1.298884 -0.059256
H  -2.904676 -1.295195 1.55133
H  -3.110523 1.00319 2.105172
H  -3.319604 2.245451 0.839708
H  -4.555265 0.961269 1.042565
H  -3.014672 1.663477 -1.623748
H  -2.692984 -0.018106 -2.138756
H  -4.29806 0.425629 -1.471872
H  -3.69028 -2.09146 -1.342555
H  -3.73798 -3.145388 0.10445
H  -4.844274 -1.747092 -0.017837
H  0.748391 -3.088084 0.103324
H  3.253479 -3.422801 -0.011113
H  4.768291 -1.439742 -0.107218
H  4.946532 0.819021 -0.154514
