program: Gaussian 09
title: 000176553
version: EM64L-G09RevD.01
frameworkgroup: C1[X(C22H23O3P)]
method: RPBEPBE
basis: SDD
operation: Freq
keyword: #p
keyword: freq=noraman
keyword: PBEPBE/SDD
title: #p freq=noraman PBEPBE/SDD
converged: NO YES NO NO
title: Mulliken charges:
elementType: P O O O C C C C C C C C C C C C C C C C C C C C C C H H H H H H H H H H H H H H H H H H H H H H H
charge: 1.216701 -0.536374 -0.536313 -0.607161 -0.117186 0.357905 0.357913 0.209621 0.209610 -0.498739 -0.498696 -0.395416 -0.395393 -0.345204 -0.345237 -0.292495 -0.258915 -0.684128 -0.684111 -0.243833 -0.243840 -0.225187 -0.225166 -0.200567 -0.212497 -0.219981 0.204839 0.208955 0.208924 0.204828 0.234844 0.234847 0.291967 0.291926 0.283134 0.256015 0.257041 0.208747 0.216482 0.216476 0.208759 0.257031 0.226415 0.226417 0.229822 0.229824 0.239615 0.240148 0.237629
chargesum: 0.00000
title: Mulliken charges with hydrogens summed into heavy atoms:
elementType: P O O O C C C C C C C C C C C C C C C C C C C C C C
charge: 1.216701 -0.536374 -0.536313 -0.607161 -0.117186 0.357905 0.357913 0.209621 0.209610 -0.084945 -0.084944 -0.160572 -0.160546 -0.053237 -0.053311 -0.009360 -0.002900 -0.001857 -0.001844 -0.017418 -0.017423 0.004636 0.004658 0.039048 0.027651 0.017648
polarizability: 3.09746405e+02 -2.99897595e-02 2.31157880e+02 -2.75380375e-02 -2.70771626e+01 2.56400966e+02
1716.lowfreq: -9.6008 -7.4726 -4.4865 -0.0010 0.0007 0.0011 6.2008 6.4981 16.2126
frequency: -5.2643 5.4246 15.8154 21.3193 38.9043 41.1115 66.5995 79.2118 87.8871 109.0204 119.0461 128.8333 131.6936 153.5920 184.0915 186.7390 193.1459 215.7397 231.9305 244.2841 273.0118 283.5204 319.4192 322.7904 346.5536 352.0216 397.5697 401.9222 438.1519 448.1489 448.6148 476.7150 496.5742 513.2550 524.7158 541.4715 552.5795 580.9516 590.5844 609.9135 645.5707 660.0640 700.3398 700.9584 734.1884 734.4886 755.2247 759.8495 762.1459 764.5904 765.4486 782.9782 783.9250 836.8829 853.2561 859.0597 873.6418 874.5901 935.6821 949.0818 949.1620 971.0200 971.3193 982.9947 983.0129 986.6222 986.7255 1008.8256 1016.0252 1024.6078 1029.5608 1032.6268 1053.9512 1055.1688 1067.0102 1067.8942 1082.5230 1091.7860 1108.4046 1114.4109 1159.7894 1168.6805 1176.1611 1176.8690 1179.4426 1190.6637 1225.1675 1227.9820 1242.5324 1243.8979 1290.7142 1291.9928 1314.5054 1316.9489 1317.6158 1380.5687 1381.0163 1383.4402 1384.3980 1386.5134 1429.8425 1433.1886 1434.6125 1463.8152 1464.6568 1466.6316 1471.2129 1474.3346 1480.1596 1482.4338 1491.0725 1494.8426 1588.4210 1589.4445 1590.2241 1594.6802 1604.8893 1607.0579 2982.0799 2982.6957 2987.8947 2988.1465 3040.6972 3040.8877 3076.5838 3077.3174 3096.0873 3096.6107 3121.5663 3121.6014 3133.5727 3137.3761 3137.4094 3141.2649 3149.8264 3154.2842 3154.4015 3159.9012 3167.7633 3167.8515 3171.9104
redmass: 3.7601 4.6487 5.5018 5.4747 4.2303 3.8646 2.7919 2.8223 5.0530 4.8243 3.7694 3.7921 4.0825 5.5868 2.9273 4.4007 3.3429 2.3509 1.4130 1.8768 3.9583 4.6359 3.9145 3.4290 4.9050 3.6264 2.8173 3.6237 4.2144 3.8211 4.3296 6.0754 4.4115 4.5232 4.3654 4.6020 4.2709 4.4625 5.9285 6.4792 7.9927 7.3685 2.0653 6.9908 4.1023 4.0578 2.1261 3.3976 1.7728 1.5775 1.3261 1.2487 1.2376 4.8531 4.9114 1.2490 1.3637 1.3965 1.3456 1.3694 1.3765 2.4492 2.4616 1.3172 1.3317 1.3824 6.0016 1.3291 4.8968 3.0653 1.9829 2.2059 2.0056 2.0462 1.8741 1.8663 1.6785 2.9836 2.2741 2.0075 1.8667 1.5244 1.1074 1.0586 1.3337 1.1602 2.2818 2.3044 1.2893 1.3136 1.3447 1.3486 1.3102 1.5193 1.5154 6.1406 6.5155 8.9932 1.2196 1.2074 2.1179 2.1675 2.1828 1.6502 1.1493 1.3454 1.0556 1.0690 2.0843 2.0403 1.1038 1.0902 6.1709 6.4936 6.5083 5.7897 6.8932 6.8394 1.0360 1.0360 1.0584 1.0584 1.1013 1.1013 1.1000 1.0999 1.1010 1.1010 1.0871 1.0871 1.0855 1.0893 1.0893 1.0884 1.0926 1.0943 1.0943 1.0970 1.1004 1.1004 1.1017
irintensity: 0.0078 0.1356 1.1130 0.2581 0.2078 0.3429 0.2299 1.0127 2.5590 0.2348 1.2127 1.2164 0.9164 0.7164 0.3761 0.9483 10.2861 6.9991 0.2908 5.4969 6.7339 3.6269 1.2755 0.5234 1.2354 14.2186 0.6077 8.2847 4.9912 5.1394 4.4044 109.9253 47.3695 54.6068 1.4905 2.5622 2.8231 7.5172 4.2765 0.0306 16.1515 96.6382 53.7794 32.0596 1.0702 33.1695 150.0264 4.8583 15.5165 21.0172 193.6120 0.1884 10.0400 374.1545 24.6271 2.7534 2.3265 5.6879 0.1897 0.4924 11.1496 1.2152 11.6303 0.1055 1.4029 0.3330 0.9454 0.0118 31.9114 24.9697 38.4930 27.0172 0.5329 13.9909 0.7228 9.9751 1.4918 51.6189 218.8334 6.3744 188.4187 11.6035 29.8820 0.3509 10.9540 0.4809 56.2848 4.9428 18.7184 3.3406 0.0061 1.1601 3.1318 0.4515 1.2570 0.0824 0.0861 0.8216 0.3752 25.3835 21.0212 79.9054 5.1469 1.5508 0.5527 11.8587 43.2172 5.1586 121.4615 12.3454 18.1747 18.9925 0.2053 35.5825 2.6215 1.5773 22.8985 5.8192 1.9995 83.2141 0.0259 60.9872 30.1807 11.8535 28.9778 59.0487 45.6530 28.3797 2.9624 10.6687 0.0760 4.0868 25.4575 3.8233 6.6314 29.0171 1.5577 12.5368 33.4355 9.0136 22.3856
temp: 298.150 k
press: 1.00000 atm
elementType: 15 8 8 8 6 6 6 6 6 6 6 6 6 6 6 6 6 6 6 6 6 6 6 6 6 6 1 1 1 1 1 1 1 1 1 1 1 1 1 1 1 1 1 1 1 1 1 1 1
symmnumber: 1
zpe: 1025060.0 jmol-1
zpe.correction: 0.390425 hartree
zpe.thermalcorrener: 0.415065 hartree
zpe.thermalcorrenthalpy: 0.416009 hartree
zpe.thermalcorrgfe: 0.332220 hartree
zpe.sumelectzpe: -1417.168282 hartree
zpe.sumelectthermal: -1417.143642 hartree
zpe.sumelectthermalent: -1417.142698 hartree
zpe.sumelectthermalfe: -1417.226488 hartree
dipole: -0.0025 2.5227 3.9255
dipole: 4.6662
quadrupole: -147.4224 -152.3785 -153.6643
quadrupole: -0.0061 -0.0028 -1.0667
quadrupole: 3.7326 -1.2234 -2.5092 -0.0061 -0.0028 -1.0667
hfenergy: -1417.5587071 hartree
pointgroup: C01 [X(C22H23O3P1)]
dipole: 0.0014171 0.8104845 -1.6472504 debye
polarizability: 309.7464194|0.0039807|237.6016824|-0.015447|29.2286192|249.9571492 unknown
InChI: InChI=1S/C22H23O3P/c1-3-18-12-8-10-16-21(18)24-26(23,20-14-6-5-7-15-20)25-22-17-11-9-13-19(22)4-2/h5-17H,3-4H2,1-2H3
charge 0 multiplicity 1
49 atoms
P  -0.000359 0.380292 0.827636
O  -1.244722 -0.793281 0.490548
O  1.243156 -0.794553 0.491872
O  -0.00077 1.067791 2.264704
C  0.001009 1.586014 -0.574068
C  -3.520943 -1.098783 -0.241166
C  3.519213 -1.102581 -0.239288
C  -2.632866 -0.529086 0.710414
C  2.631442 -0.530989 0.711443
C  -3.004177 -1.906546 -1.419629
C  3.001984 -1.911726 -1.416596
C  -4.907591 -0.909621 -0.02018
C  4.905962 -0.913924 -0.018523
C  -3.087624 0.192103 1.836305
C  3.086604 0.191489 1.836342
C  0.001603 2.964659 -0.261381
C  0.00143 1.13487 -1.914911
C  -2.497273 -3.31393 -1.005172
C  2.494383 -3.318276 -1.000162
C  -5.390441 -0.181727 1.091265
C  5.389216 -0.18476 1.091915
C  -4.477523 0.369641 2.01777
C  4.4766 0.368457 2.017614
C  0.00265 3.907353 -1.313467
C  0.002485 2.085294 -2.958051
C  0.003095 3.46884 -2.657832
H  -3.810622 -2.008486 -2.170175
H  -2.170876 -1.363707 -1.905417
H  2.168922 -1.369164 -1.903104
H  3.808342 -2.015134 -2.167037
H  -5.614878 -1.339225 -0.740123
H  5.61302 -1.34497 -0.737828
H  -2.369181 0.597526 2.555896
H  2.368384 0.598267 2.555401
H  0.001235 3.280564 0.787377
H  0.000942 0.06215 -2.137087
H  -1.663605 -3.224415 -0.287953
H  -2.138086 -3.874655 -1.88794
H  -3.303867 -3.900293 -0.529173
H  3.300678 -3.904377 -0.523335
H  2.134921 -3.880052 -1.88215
H  1.660741 -3.227348 -0.283094
H  -6.468362 -0.04852 1.232864
H  6.467213 -0.052006 1.233364
H  -4.839395 0.929248 2.887099
H  4.838772 0.92905 2.886181
H  0.003118 4.978024 -1.084028
H  0.00283 1.749779 -4.000448
H  0.003915 4.202825 -3.471191
