program: Gaussian 09
title: 000176528
version: EM64L-G09RevD.01
frameworkgroup: C1[X(C14H13Cl3N2O3)]
method: RPBEPBE
basis: SDD
operation: Freq
keyword: #p
keyword: freq=noraman
keyword: PBEPBE/SDD
title: #p freq=noraman PBEPBE/SDD
converged: YES YES NO NO
title: Mulliken charges:
elementType: Cl Cl Cl O O O N N C C C C C C C C C C C C C C H H H H H H H H H H H H H
charge: -0.074104 -0.034647 -0.033163 -0.234235 -0.210937 -0.173388 -0.240310 -0.366872 0.192040 0.242087 -0.473391 -0.618576 -0.713143 -0.712725 0.273548 0.163344 0.531578 -0.322912 -0.319348 -0.072130 -0.074718 -0.247920 0.296756 0.298732 0.285063 0.285033 0.208910 0.248025 0.275765 0.273231 0.209472 0.248024 0.303123 0.299896 0.287892
chargesum: 0.00000
title: Mulliken charges with hydrogens summed into heavy atoms:
elementType: Cl Cl Cl O O O N N C C C C C C C C C C C C C C
charge: -0.074104 -0.034647 -0.033163 -0.234235 -0.210937 -0.173388 -0.240310 -0.366872 0.192040 0.242087 0.122096 -0.048480 0.019557 0.018003 0.273548 0.163344 0.531578 -0.019789 -0.019452 -0.072130 -0.074718 0.039972
polarizability: 2.84410153e+02 3.73119841e+00 2.21965404e+02 -1.21745543e+01 -3.09648434e+00 1.17673978e+02
1716.lowfreq: -5.0865 -2.9454 -0.0026 -0.0025 -0.0016 2.1397 15.7180 32.3095 38.5773
frequency: 15.6921 32.2711 38.5760 47.4529 93.3711 105.6136 108.4419 117.2277 133.5219 147.0733 161.9841 187.3884 195.4037 200.6466 219.3801 227.9970 247.9829 253.3823 262.0861 286.5998 292.6517 311.3816 336.4611 363.3539 372.1929 383.7255 411.5367 451.3297 482.4062 510.0380 512.8994 542.5745 571.8240 588.6889 608.1754 661.7550 676.7388 699.7488 712.3339 724.8540 727.5803 759.4443 800.2445 846.7652 863.3890 872.3166 876.2405 878.3442 948.8887 969.3891 970.0443 983.3893 985.7254 1010.3723 1017.9403 1084.8830 1092.9673 1114.5534 1115.4075 1157.6719 1166.9269 1170.2611 1196.5229 1225.2779 1241.0291 1246.8916 1267.0524 1282.8159 1318.9358 1338.3218 1376.5954 1379.2240 1398.0291 1421.4828 1439.6671 1443.8629 1450.3270 1462.1909 1482.1381 1483.9428 1500.8780 1554.5091 1569.6549 1598.3264 1657.2728 1707.0344 2992.9802 2994.6889 3034.8575 3074.6968 3085.9479 3089.5367 3089.5593 3126.3725 3129.2516 3161.8910 3189.8806 3206.1190 3208.5076
redmass: 12.9537 6.6260 9.8834 12.9775 5.1793 5.4557 3.5381 5.7540 6.6695 13.6063 7.2723 1.5429 5.7188 4.6328 10.4103 1.0729 2.0746 5.9897 5.7196 7.5291 3.8181 4.9338 2.9051 11.6741 2.1542 12.1637 8.4708 5.3452 5.2507 5.1187 5.2222 4.0657 6.4495 4.4336 7.9795 2.7361 3.9332 6.0423 8.7920 7.7344 6.8356 10.7556 5.9227 3.3072 1.5800 1.3827 1.5013 1.5753 1.4445 4.5258 2.2237 5.2926 2.0192 4.3870 1.2945 1.4294 2.1927 1.8092 2.9172 4.5683 2.5242 1.1453 5.6195 3.1066 1.8294 2.7278 1.2149 1.4314 2.1768 4.1657 10.5067 1.1692 1.1972 2.9389 1.1014 2.4560 1.2482 1.0452 1.0604 1.0505 1.0550 11.7467 7.5341 7.1440 11.4448 12.5075 1.0377 1.0385 1.0601 1.0569 1.0986 1.0987 1.1021 1.0989 1.0982 1.1114 1.0940 1.0932 1.0937
irintensity: 0.0432 0.1067 0.0593 0.0980 0.0805 1.2084 2.9545 7.4089 5.7236 0.9990 0.1413 0.8348 4.5566 0.4576 1.5472 0.2936 0.4725 0.6326 0.4584 12.3042 4.2873 4.5978 1.7592 3.1149 0.0573 14.7713 8.4175 0.7974 3.3280 5.2172 5.0365 0.3494 91.9390 0.7999 15.6819 26.0726 7.0855 25.5546 2.5761 12.4835 60.3692 75.8358 8.2187 83.9369 39.0436 0.0523 13.1221 1.8474 2.4774 76.5654 0.6866 7.1421 2.0067 20.1699 0.2484 0.9536 73.2142 8.1133 54.2762 22.6492 320.1951 18.6952 182.3011 111.0182 0.7424 419.4687 1.0695 69.2670 66.4564 266.1932 0.9884 29.1752 32.1804 73.1025 20.7568 139.0039 5.3309 0.0123 14.0075 4.8128 31.8382 139.1841 94.3222 120.5045 573.7661 18.0316 41.9617 5.0368 5.1876 5.5180 7.2224 15.6566 4.1291 0.1331 3.7639 6.7784 2.2535 5.4564 1.8685
temp: 298.150 k
press: 1.00000 atm
elementType: 17 17 17 8 8 8 7 7 6 6 6 6 6 6 6 6 6 6 6 6 6 6 1 1 1 1 1 1 1 1 1 1 1 1 1
symmnumber: 1
zpe: 652776.9 jmol-1
zpe.correction: 0.248630 hartree
zpe.thermalcorrener: 0.270333 hartree
zpe.thermalcorrenthalpy: 0.271278 hartree
zpe.thermalcorrgfe: 0.195919 hartree
zpe.sumelectzpe: -2255.075474 hartree
zpe.sumelectthermal: -2255.053770 hartree
zpe.sumelectthermalent: -2255.052826 hartree
zpe.sumelectthermalfe: -2255.128184 hartree
dipole: -0.1167 -0.5575 -0.1921
dipole: 0.6011
quadrupole: -172.7193 -159.5830 -147.9049
quadrupole: -7.6395 -3.4868 -5.0169
quadrupole: -12.6502 0.4861 12.1641 -7.6395 -3.4868 -5.0169
hfenergy: -2255.3241034 hartree
pointgroup: C01 [X(C14H13Cl3N2O3)]
dipole: -0.0342322 0.2287211 0.0493413 debye
polarizability: 284.1174832|-5.5708776|220.182548|11.0386279|-15.8048437|119.7495044 unknown
InChI: InChI=1S/C14H13Cl3N2O3/c1-14(2,7-15)12(21)18-6-11(20)19(13(18)22)10-4-8(16)3-9(17)5-10/h3-5H,6-7H2,1-2H3
charge 0 multiplicity 1
35 atoms
Cl 6.204641 -1.787629 -0.520497
Cl -3.99239 -3.314123 1.100022
Cl -5.781098 1.357175 -1.302799
O  3.583488 1.778927 0.323555
O  0.44816 -1.253765 -0.220333
O  -1.347691 3.029837 0.588103
N  1.495495 0.879622 0.167455
N  -0.792255 0.743018 0.167548
C  3.617956 -0.625461 -0.187524
C  2.919715 0.722531 0.113081
C  1.000715 2.252423 0.437424
C  5.13556 -0.271807 -0.160037
C  3.221141 -1.142738 -1.601056
C  3.300405 -1.667363 0.924705
C  0.414294 -0.027874 0.011059
C  -0.514104 2.116302 0.416093
C  -2.111883 0.174064 0.074601
C  -3.152621 0.943828 -0.50188
C  -2.358911 -1.128826 0.572929
C  -3.663327 -1.641386 0.47047
C  -4.438079 0.379703 -0.566764
C  -4.72941 -0.913535 -0.092109
H  1.351279 2.963718 -0.329366
H  1.35276 2.624684 1.414453
H  5.461095 0.082354 0.827327
H  5.405119 0.460777 -0.932593
H  3.440924 -0.385448 -2.376456
H  3.817698 -2.04261 -1.828322
H  2.157199 -1.416441 -1.646643
H  2.241143 -1.961441 0.910337
H  3.560391 -1.27247 1.92443
H  3.911527 -2.568644 0.746471
H  -2.969495 1.953702 -0.870467
H  -1.559261 -1.7288 1.008035
H  -5.735879 -1.332503 -0.156949
