program: Gaussian 09
title: 000176510
version: EM64L-G09RevD.01
frameworkgroup: C1[X(C15H12F2N2O3)]
method: RPBEPBE
basis: SDD
operation: Freq
keyword: #p
keyword: freq=noraman
keyword: PBEPBE/SDD
title: #p freq=noraman PBEPBE/SDD
converged: YES YES NO NO
title: Mulliken charges:
elementType: F F O O O N N C C C C C C C C C C C C C C C H H H H H H H H H H H H
charge: -0.218306 -0.157486 -0.265615 -0.164815 -0.211568 -0.481732 -0.493640 0.492704 -0.090922 -0.433157 -0.335952 0.318802 -0.330110 -0.343656 0.212304 0.283794 0.255120 0.277153 -0.376604 -0.382028 -0.146818 -0.537901 0.220677 0.303036 0.305904 0.251885 0.243187 0.333689 0.266068 0.268254 0.247878 0.222074 0.223071 0.244710
chargesum: 0.00000
title: Mulliken charges with hydrogens summed into heavy atoms:
elementType: F F O O O N N C C C C C C C C C C C C C C C
charge: -0.218306 -0.157486 -0.265615 -0.164815 -0.211568 -0.175828 -0.159951 0.492704 -0.090922 -0.212480 -0.032916 0.318802 -0.078225 -0.100469 0.212304 0.283794 0.255120 0.277153 -0.110535 -0.113773 0.101060 0.151953
polarizability: 3.42742702e+02 8.47845747e-01 1.89293061e+02 -3.98717119e+00 6.27684485e-01 8.61281432e+01
1716.lowfreq: -7.7950 -2.5132 0.0003 0.0008 0.0009 0.3834 15.1977 19.3902 32.4187
frequency: 14.6243 19.3739 32.3467 50.5256 65.8538 70.5540 94.0609 116.2809 137.5528 166.4600 183.8908 212.0325 229.6950 241.7976 252.3017 261.1591 291.2889 330.8861 359.7333 379.6340 385.8698 414.9076 445.2422 474.8516 495.9215 509.3171 522.6371 529.4327 563.7938 570.1998 576.3770 608.3955 627.7938 648.9430 663.4708 703.0972 721.0068 738.0821 756.5769 767.3093 801.5142 812.7937 832.1053 835.3797 881.3021 889.2842 933.1277 939.9698 965.9696 967.7331 969.5129 987.6477 1000.1732 1051.5738 1101.5949 1111.4132 1118.9200 1156.3747 1159.5565 1166.9028 1182.7576 1200.9705 1221.6308 1230.7099 1232.6284 1264.1632 1308.5928 1372.5640 1375.9604 1420.6307 1434.2908 1435.6348 1447.3978 1450.2537 1466.5062 1473.7218 1499.7241 1510.5040 1575.0129 1595.8885 1619.3629 1629.7361 1634.9643 1677.5756 2959.2173 3046.9523 3114.5017 3125.4046 3159.9992 3162.5605 3170.5609 3182.7048 3193.2237 3193.6222 3515.1193 3524.2947
redmass: 4.6452 6.8611 7.3907 6.7086 6.8593 5.3465 4.3687 5.4515 7.0412 10.9735 3.6228 5.9740 4.7809 1.4614 3.5765 6.8890 10.0804 7.9729 6.9320 5.3778 8.5019 3.0923 5.2747 5.0537 6.6104 5.8551 2.5128 5.5498 5.8309 1.3562 3.8819 1.2576 6.5899 5.9114 5.5369 6.4035 3.7113 6.2894 2.3646 5.7792 2.5313 1.3067 2.9492 2.2709 1.3993 7.3416 7.7344 1.3685 2.4017 2.0340 1.3685 8.2448 2.7366 2.5040 2.5750 1.2606 1.3519 1.8363 1.5673 1.1907 1.2452 2.6311 2.5787 5.1094 2.6837 2.2830 1.4401 5.3719 10.4339 3.9821 2.6753 1.2084 2.5981 2.1305 1.0503 1.0789 2.0265 2.4929 7.1612 5.4750 8.4154 6.4421 5.3005 7.7007 1.0329 1.1039 1.0900 1.0994 1.0895 1.0881 1.0946 1.0931 1.0998 1.0950 1.0775 1.0764
irintensity: 0.0815 1.6429 0.7669 8.7754 2.6736 4.9705 10.1359 2.9691 0.8601 0.2810 2.0029 1.3037 0.0205 0.0443 0.2729 1.2016 1.1111 6.9227 1.4150 1.2518 8.6929 0.0771 6.1339 2.9119 4.7747 44.4484 31.7967 2.6074 2.0304 62.2631 1.7529 133.5853 1.6909 13.5310 0.4272 47.9419 0.9516 14.3636 14.9043 9.7096 70.5256 13.8221 18.9034 86.5399 0.4811 26.7147 41.6807 0.6349 36.4365 32.0154 6.0389 38.8537 25.0744 8.2900 29.8649 0.1553 18.7498 257.3394 219.3368 87.0747 18.9636 15.9695 416.4164 19.2275 11.6410 18.9534 11.7447 76.7330 2.6281 19.5722 123.7447 72.7661 190.9000 819.3612 13.5471 21.3754 15.6880 354.6645 35.7121 8.2549 96.2253 26.4553 67.7746 322.1193 74.0652 49.1279 18.9816 26.9883 10.9048 4.2631 5.8786 0.7989 2.4765 6.2880 20.1642 27.1419
temp: 298.150 k
press: 1.00000 atm
elementType: 9 9 8 8 8 7 7 6 6 6 6 6 6 6 6 6 6 6 6 6 6 6 1 1 1 1 1 1 1 1 1 1 1 1
symmnumber: 1
zpe: 643145.1 jmol-1
zpe.correction: 0.244961 hartree
zpe.thermalcorrener: 0.264854 hartree
zpe.thermalcorrenthalpy: 0.265798 hartree
zpe.thermalcorrgfe: 0.193418 hartree
zpe.sumelectzpe: -1112.092063 hartree
zpe.sumelectthermal: -1112.072170 hartree
zpe.sumelectthermalent: -1112.071226 hartree
zpe.sumelectthermalfe: -1112.143606 hartree
dipole: 1.4011 5.5224 -2.0043
dipole: 6.0396
quadrupole: -78.8250 -128.7937 -130.9659
quadrupole: 24.4049 -5.2024 3.6260
quadrupole: 34.0365 -15.9322 -18.1043 24.4049 -5.2024 3.6260
hfenergy: -1112.3370239 hartree
pointgroup: C01 [X(C15H12F2N2O3)]
dipole: -0.5083629 -2.1212234 -0.9424445 debye
polarizability: 342.631602|3.3559523|188.9379521|5.0222619|6.7447554|86.5943528 unknown
InChI: InChI=1S/C15H12F2N2O3/c1-22-10-7-5-9(6-8-10)18-15(21)19-14(20)13-11(16)3-2-4-12(13)17/h2-8,18-19H,1H3
charge 0 multiplicity 1
34 atoms
F  -2.591271 -2.233812 0.199174
F  -4.583671 2.186209 -0.12593
O  6.875284 -0.357832 -0.112046
O  -2.203075 1.699612 1.263678
O  0.545746 1.823371 0.136476
N  1.219935 -0.43786 0.174025
N  -1.05226 0.062668 0.029552
C  2.641961 -0.32681 0.101313
C  -3.510617 0.019706 0.099379
C  3.391934 -1.535569 0.107835
C  3.325187 0.911739 0.025788
C  5.475386 -0.270411 -0.044698
C  4.793147 -1.510417 0.037488
C  4.735406 0.936417 -0.050985
C  -2.210742 0.686985 0.525477
C  -3.709912 -1.377926 0.000393
C  -4.675811 0.794878 -0.145299
C  0.284246 0.597154 0.131334
C  -4.935686 -1.995445 -0.281004
C  -5.931889 0.236786 -0.439573
C  -6.059052 -1.167449 -0.49934
C  7.624766 0.898496 -0.184912
H  2.875834 -2.502768 0.166292
H  2.754981 1.842306 0.034979
H  0.861795 -1.382073 0.336983
H  5.378042 -2.434719 0.043372
H  5.238271 1.906207 -0.108711
H  -1.172499 -0.838464 -0.44073
H  -4.998782 -3.085497 -0.324942
H  -6.780828 0.901014 -0.620154
H  -7.030913 -1.617589 -0.72093
H  7.364637 1.471091 -1.096602
H  7.44679 1.525794 0.710231
H  8.682659 0.60021 -0.224214
