program: Gaussian 09
title: 000176512
version: EM64L-G09RevD.01
frameworkgroup: C1[X(C16H11F2N3O2)]
method: RPBEPBE
basis: SDD
operation: Freq
keyword: #p
keyword: freq=noraman
keyword: PBEPBE/SDD
title: #p freq=noraman PBEPBE/SDD
converged: YES YES NO NO
title: Mulliken charges:
elementType: F F O O N N N C C C C C C C C C C C C C C C C H H H H H H H H H H H
charge: -0.219572 -0.156052 -0.159762 -0.206147 -0.487567 -0.495104 -0.017514 0.496877 0.429787 -0.459011 -0.342709 -0.367415 -0.359179 -0.091273 -0.526322 0.215019 0.284802 0.286082 0.256957 -0.375322 -0.380834 -0.146272 -0.157460 0.223590 0.308562 0.254089 0.232640 0.308572 0.265286 0.263294 0.335493 0.267489 0.269610 0.249365
chargesum: 0.00000
title: Mulliken charges with hydrogens summed into heavy atoms:
elementType: F F O O N N N C C C C C C C C C C C C C C C C
charge: -0.219572 -0.156052 -0.159762 -0.206147 -0.178995 -0.159612 -0.017514 0.496877 0.429787 -0.235421 -0.034147 -0.113326 -0.126538 -0.091273 0.002259 0.215019 0.284802 0.286082 0.256957 -0.107833 -0.111224 0.103094 -0.157460
polarizability: 3.40515018e+02 -5.75319226e+00 2.03163075e+02 -5.19883909e+00 2.61649206e+00 8.88160553e+01
1716.lowfreq: -4.8060 -2.1162 0.0005 0.0010 0.0011 3.4859 10.4079 20.9297 25.3167
frequency: 10.1107 20.8885 25.2024 31.0075 50.9867 65.4850 74.8406 99.9021 122.8231 132.8179 172.6763 173.8907 229.2206 232.2152 256.1263 293.1954 295.5774 324.7144 343.6102 361.0023 375.9560 384.1190 409.0245 443.6941 475.3699 495.0643 511.6986 515.1794 559.1643 573.0614 573.8626 587.5403 619.2884 631.2669 660.0162 677.4590 707.5949 714.1059 750.7732 757.8880 776.8187 802.3373 823.2134 836.8838 848.8237 881.9872 890.8397 929.2801 933.6498 948.6093 967.4009 967.8821 970.3376 991.1900 1009.9279 1051.3294 1099.6860 1131.8260 1155.7165 1167.2969 1196.4327 1202.1153 1203.1329 1206.3748 1227.8921 1231.8906 1269.6687 1277.6056 1322.8552 1374.8728 1376.9563 1415.8712 1433.7666 1439.3367 1447.7876 1453.0096 1499.5952 1515.8402 1573.9811 1597.9654 1619.9219 1630.9273 1637.2061 1680.8910 2204.6190 2979.1833 3025.7775 3115.4550 3125.8238 3149.7563 3163.4066 3183.3799 3193.7856 3196.6084 3510.9927 3521.4678
redmass: 8.3304 6.2240 5.1196 6.1362 6.8172 6.6186 6.5469 8.1354 6.3644 7.8578 5.9710 7.6736 4.8507 9.8209 8.5650 8.3452 9.8123 3.2211 8.6407 4.7310 6.2746 9.0932 2.9562 8.4464 5.0423 6.7107 3.1976 4.5711 5.6362 4.7184 1.7063 3.2584 1.2591 6.4930 4.9525 6.2384 5.8650 3.1335 5.6806 2.4680 5.0361 2.5381 1.5722 5.9425 1.2787 1.3991 7.1757 1.7134 7.7458 4.4489 1.5193 1.4669 5.0334 1.3486 3.0062 2.5508 2.6707 1.3671 2.4387 1.1731 1.6437 1.9308 1.5665 1.1300 4.8286 2.8387 2.0911 1.7683 1.4793 8.9776 4.1979 3.5676 2.7655 1.0913 3.0968 1.9197 1.9146 2.8373 7.1228 5.2921 8.4406 6.1169 5.1222 7.5998 12.4725 1.0589 1.0990 1.0892 1.0910 1.0954 1.0882 1.0931 1.0998 1.0944 1.0776 1.0765
irintensity: 4.6630 8.3157 1.0296 1.1140 5.5906 2.2608 4.1270 4.3043 7.8462 4.1893 0.5597 1.5912 0.1376 2.4578 0.5675 1.3623 1.5470 1.9892 4.2135 0.0781 0.4039 5.6339 0.0230 7.1045 0.7169 3.5410 25.3171 39.1124 0.6911 8.8174 27.9843 5.1094 145.8195 2.5117 9.2582 19.2553 52.7622 2.2171 2.6855 13.0341 0.0823 73.3457 67.6576 8.5961 7.8887 0.4786 28.1256 20.4493 43.2048 4.0281 1.5868 6.9297 43.2746 1.3575 6.7526 9.0598 34.9286 22.4577 467.1271 62.6764 6.4847 28.2886 1.3072 0.3200 281.5830 12.6052 3.8977 4.4763 52.1144 22.6899 128.7099 38.6338 95.8375 20.7251 25.2394 1087.6052 119.9050 176.6939 39.2117 42.9458 105.4165 11.3756 68.2400 290.2621 11.9175 11.0668 2.4354 18.5329 14.0717 4.5194 4.2033 0.6071 1.8451 6.4754 24.6082 29.0034
temp: 298.150 k
press: 1.00000 atm
elementType: 9 9 8 8 7 7 7 6 6 6 6 6 6 6 6 6 6 6 6 6 6 6 6 1 1 1 1 1 1 1 1 1 1 1
symmnumber: 1
zpe: 628814.7 jmol-1
zpe.correction: 0.239503 hartree
zpe.thermalcorrener: 0.260035 hartree
zpe.thermalcorrenthalpy: 0.260979 hartree
zpe.thermalcorrgfe: 0.185776 hartree
zpe.sumelectzpe: -1129.089658 hartree
zpe.sumelectthermal: -1129.069126 hartree
zpe.sumelectthermalent: -1129.068182 hartree
zpe.sumelectthermalfe: -1129.143385 hartree
dipole: 4.4262 4.1340 -1.8015
dipole: 6.3187
quadrupole: -125.2074 -138.2310 -134.6575
quadrupole: 43.7612 -5.5006 3.3976
quadrupole: 7.4913 -5.5324 -1.9589 43.7612 -5.5006 3.3976
hfenergy: -1129.3291605 hartree
pointgroup: C01 [X(C16H11F2N3O2)]
dipole: -1.7937418 1.6208181 0.5792825 debye
polarizability: 340.3167532|8.6230538|202.9633929|2.1672565|-7.7805146|89.2140023 unknown
InChI: InChI=1S/C16H11F2N3O2/c17-12-2-1-3-13(18)14(12)15(22)21-16(23)20-11-6-4-10(5-7-11)8-9-19/h1-7,20-21H,8H2
charge 0 multiplicity 1
34 atoms
F  -2.816499 2.181416 -0.444189
F  -5.065793 -2.046048 0.392874
O  -2.615783 -1.895435 -0.915961
O  0.093497 -1.96551 0.247974
N  0.889905 0.238964 -0.033416
N  -1.40959 -0.132744 0.066756
N  8.022892 1.992822 0.33006
C  2.295946 0.066764 0.115221
C  5.125533 -0.117197 0.392124
C  3.113995 1.217271 -0.031419
C  2.901629 -1.1867 0.39917
C  4.513064 1.124404 0.104124
C  4.301263 -1.259781 0.536641
C  -3.863026 0.010648 -0.080616
C  6.643114 -0.27671 0.543891
C  -2.59088 -0.776368 -0.354392
C  -0.105812 -0.738575 0.094039
C  -3.987553 1.41744 -0.178323
C  -5.078257 -0.66308 0.21912
C  -5.184836 2.12964 -0.033052
C  -6.309758 -0.005845 0.383736
C  -6.359807 1.39778 0.24836
C  7.405726 0.976717 0.426229
H  2.657739 2.19134 -0.250211
H  2.279437 -2.07755 0.497759
H  5.126066 2.024705 -0.013039
H  4.755608 -2.234143 0.756181
H  0.591125 1.17301 -0.325038
H  7.025794 -0.982337 -0.22038
H  6.878392 -0.72918 1.527589
H  -1.494681 0.840465 0.372736
H  -5.187668 3.217273 -0.138244
H  -7.200207 -0.594971 0.617189
H  -7.311576 1.92321 0.367508
