program: Gaussian 09
title: 000176576
version: EM64L-G09RevD.01
frameworkgroup: C1[X(C18H10BrF3N2O4)]
method: RPBEPBE
basis: SDD
operation: Freq
keyword: #p
keyword: freq=noraman
keyword: PBEPBE/SDD
title: #p freq=noraman PBEPBE/SDD
converged: YES YES NO NO
title: Mulliken charges:
elementType: Br F F F O O O O N N C C C C C C C C C C C C C C C C C C H H H H H H H H H H
charge: 0.018903 -0.161535 -0.161442 -0.163439 -0.423692 -0.400111 -0.208714 -0.219670 -0.338795 -0.017216 0.266318 0.461083 -0.026104 0.306310 -0.028266 -0.448828 -0.379705 0.321863 -0.297112 -0.357498 -0.192660 -0.361560 0.098878 0.252128 -0.213781 -0.212844 0.128794 -0.196232 0.302539 0.294695 0.299630 0.260676 0.246207 0.270409 0.243232 0.258974 0.390236 0.388330
chargesum: 0.00000
title: Mulliken charges with hydrogens summed into heavy atoms:
elementType: Br F F F O O O O N N C C C C C C C C C C C C C C C C C C
charge: 0.018903 -0.161535 -0.161442 -0.163439 -0.033456 -0.011781 -0.208714 -0.219670 -0.338795 -0.017216 0.266318 0.461083 -0.026104 0.306310 -0.028266 -0.146289 -0.085010 0.321863 0.002517 -0.096822 0.053547 -0.091150 0.098878 0.252128 -0.213781 0.030388 0.128794 0.062742
polarizability: 3.04104706e+02 1.11846481e+01 2.93143764e+02 1.47919465e+01 -3.06569375e+01 1.49191928e+02
1716.lowfreq: -1.8087 -0.0010 -0.0007 -0.0005 3.0634 7.0721 15.7850 19.4767 20.7695
frequency: 15.7666 19.3592 20.7593 29.0534 34.9682 46.1503 54.2999 68.4497 81.5528 103.0193 127.6996 128.4561 142.5006 175.2370 180.4091 196.4581 213.2395 238.1203 248.0400 267.7050 297.0830 305.5446 318.2509 335.1394 344.2956 357.1822 388.3515 422.3553 430.6477 437.0686 482.4630 490.6832 497.9940 524.5685 553.6791 567.2484 592.3544 607.1320 613.1274 632.2615 644.9242 650.2462 654.4051 661.7996 690.3786 694.4376 697.9375 717.1872 725.3541 754.4092 784.4223 797.3334 812.7828 815.9233 901.5564 913.7232 920.2156 933.3704 965.9559 982.1929 984.6456 987.0909 988.2519 992.0441 994.4520 1016.6173 1030.3770 1045.6923 1070.6409 1093.3315 1097.3616 1107.6002 1129.3706 1154.8173 1184.6458 1187.3509 1238.2757 1265.1865 1275.1716 1295.7039 1311.1213 1330.3354 1347.7459 1366.0579 1393.3230 1396.5504 1420.4633 1443.6603 1459.2779 1475.6472 1486.4978 1535.2330 1562.8828 1600.3188 1603.5688 1620.9085 1645.7303 1666.4536 3143.2560 3156.0872 3160.7377 3174.9699 3178.8499 3184.0119 3188.1400 3192.9672 3508.2375 3514.3932
redmass: 12.5056 14.2572 14.7460 10.7920 8.1546 5.5572 9.8569 6.6368 9.4741 13.0584 10.5754 7.2808 9.0609 5.4432 6.4098 6.6804 8.8779 8.2822 5.2733 8.0780 7.3453 6.6339 8.2050 8.2145 9.2128 6.3813 8.5664 5.3910 5.0137 3.6773 6.1717 6.1128 6.2234 8.2030 6.5779 1.7876 1.4699 9.5854 6.2121 5.5741 3.8551 6.1327 4.3303 3.5478 3.1424 2.3726 4.2774 8.1133 6.8948 7.0493 4.2918 2.1631 1.5087 4.6987 1.4572 1.4281 1.3992 1.4059 9.0039 6.1721 4.4442 1.7605 5.1742 5.0809 1.4644 5.6086 4.9700 4.5500 2.4207 1.8485 1.8616 2.1402 2.3190 3.1642 1.0891 1.0899 2.4639 2.3816 2.9718 1.3025 1.4267 4.0151 5.4682 8.6892 9.7030 3.7741 3.4974 3.4968 3.1252 6.9894 3.1408 8.7890 6.4723 6.7003 6.6837 6.3401 9.3260 9.3294 1.0877 1.0881 1.0934 1.0940 1.0983 1.0931 1.0982 1.0934 1.0639 1.0641
irintensity: 0.1733 1.2737 0.9686 0.8161 0.4616 0.4450 0.2558 0.8440 2.1812 0.1019 1.0853 0.4478 1.1961 1.0765 0.2586 1.3912 1.4558 1.1783 0.7365 0.4546 6.0642 1.2061 4.1146 0.5810 5.9656 2.8797 3.0182 3.2156 0.9845 6.1958 6.3494 7.5789 14.0772 8.6669 3.0434 57.1004 142.3065 4.6479 37.1147 39.1170 48.0847 1.7590 14.5243 25.8954 30.6703 23.8430 9.1775 15.2887 57.0147 71.2395 11.5010 15.4129 58.0884 57.1202 16.4778 38.1343 10.5418 2.0919 60.2623 104.0563 118.6048 33.6775 14.9630 226.4617 0.4520 156.0144 238.3912 41.9734 20.9896 14.7991 9.1644 2.5623 78.9630 76.4074 0.5259 2.5124 21.4434 88.5893 71.9688 22.7705 20.5282 128.3738 125.3795 21.1685 2.7863 32.6492 91.5541 70.4592 48.2904 10.4183 50.5736 21.9533 43.9400 18.4343 14.6128 17.8074 143.8074 440.1552 2.8547 5.9543 4.8330 2.8498 5.0132 0.5412 1.5703 2.1747 41.6457 49.7155
temp: 298.150 k
press: 1.00000 atm
elementType: 35 9 9 9 8 8 8 8 7 7 6 6 6 6 6 6 6 6 6 6 6 6 6 6 6 6 6 6 1 1 1 1 1 1 1 1 1 1
symmnumber: 1
zpe: 649053.6 jmol-1
zpe.correction: 0.247211 hartree
zpe.thermalcorrener: 0.272021 hartree
zpe.thermalcorrenthalpy: 0.272965 hartree
zpe.thermalcorrgfe: 0.187556 hartree
zpe.sumelectzpe: -1413.350023 hartree
zpe.sumelectthermal: -1413.325214 hartree
zpe.sumelectthermalent: -1413.324269 hartree
zpe.sumelectthermalfe: -1413.409679 hartree
dipole: 1.0157 -2.3130 2.7204
dipole: 3.7124
quadrupole: -190.8299 -147.6100 -166.2278
quadrupole: 6.8823 8.9788 -4.2052
quadrupole: -22.6073 20.6125 1.9948 6.8823 8.9788 -4.2052
hfenergy: -1413.5972344 hartree
pointgroup: C01 [X(C18H10Br1F3N2O4)]
dipole: -0.5154909 0.6617037 1.1956904 debye
polarizability: 298.9459322|16.491011|285.8957772|-21.593985|47.6600062|161.5986888 unknown
InChI: InChI=1S/C18H10BrF3N2O4/c19-11-5-1-3-9(7-11)15-13(16(25)26)14(17(27)28)23-24(15)12-6-2-4-10(8-12)18(20,21)22/h1-8,25,27H
charge 0 multiplicity 1
38 atoms
Br -1.180891 -5.016357 -1.470874
F  -5.176674 1.943414 -0.838806
F  -3.965838 0.179193 -1.604142
F  -4.748463 0.184525 0.521403
O  2.950918 -2.585331 -1.031663
O  4.512274 2.793197 -0.12272
O  4.537253 -1.59116 0.345015
O  5.100755 0.91871 -1.371243
N  0.789568 1.011199 0.101569
N  1.880575 1.855555 -0.094849
C  1.137141 -0.348688 0.028755
C  -0.495166 1.631317 0.286363
C  2.522834 -0.365325 -0.240858
C  0.1978 -1.444896 0.362269
C  2.929939 1.011629 -0.294548
C  -1.670929 1.030372 -0.212038
C  -0.54556 2.885655 0.940337
C  -2.906559 1.683027 -0.013464
C  -0.002649 -2.517882 -0.545437
C  -0.505877 -1.429936 1.597499
C  -1.78747 3.529325 1.113173
C  -2.977807 2.93012 0.648677
C  3.443494 -1.525393 -0.255344
C  -4.169596 1.016237 -0.482699
C  -0.906542 -3.542484 -0.206241
C  -1.405002 -2.468571 1.912922
C  4.272304 1.527276 -0.658061
C  -1.6185 -3.53703 1.010423
H  -1.633067 0.086707 -0.760587
H  0.385524 3.343115 1.284057
H  0.547601 -2.542581 -1.487891
H  -0.338915 -0.616492 2.311205
H  -1.827105 4.501132 1.614194
H  -3.942904 3.427281 0.782341
H  -1.945276 -2.454032 2.86466
H  -2.319509 -4.340827 1.25168
H  3.595698 -3.343497 -0.98661
H  5.407622 3.103696 -0.429368
