program: Gaussian 09
title: 000176483
version: EM64L-G09RevD.01
frameworkgroup: C1[X(C19H18)]
method: RPBEPBE
basis: SDD
operation: Freq
keyword: #p
keyword: freq=noraman
keyword: PBEPBE/SDD
title: #p freq=noraman PBEPBE/SDD
converged: YES YES NO NO
title: Mulliken charges:
elementType: C C C C C C C C C C C C C C C C C C C H H H H H H H H H H H H H H H H H H
charge: 0.079031 -0.520869 0.318583 -0.472696 0.122957 -0.551648 0.229497 0.055839 -0.499026 0.161698 0.085150 -0.414242 0.291498 -0.853228 -0.374114 -0.868971 -0.395391 -0.270247 -0.276197 0.218640 0.237277 0.222293 0.217981 0.222922 0.223315 0.241323 0.222874 0.225748 0.246478 0.237318 0.220867 0.233511 0.248974 0.235182 0.245640 0.226186 0.225851
chargesum: 0.00000
title: Mulliken charges with hydrogens summed into heavy atoms:
elementType: C C C C C C C C C C C C C C C C C C C
charge: 0.079031 -0.064951 0.318583 -0.032422 0.122957 -0.105411 0.229497 0.055839 -0.257704 0.161698 0.085150 -0.191368 0.291498 -0.143685 -0.153247 -0.151304 -0.149752 -0.044061 -0.050346
polarizability: 3.27178584e+02 3.96839436e-01 2.26134615e+02 -5.09136105e+00 1.90602348e+00 9.90557531e+01
1716.lowfreq: -7.3908 -1.0588 -0.0006 -0.0003 0.0001 10.6186 43.0341 65.0739 116.2709
frequency: 43.0194 65.0572 116.2692 121.7856 156.4309 170.8123 179.5015 193.9846 210.7345 258.7484 292.6015 312.5321 319.2288 341.6671 383.9594 420.9972 442.6279 451.3360 463.9962 484.4637 541.1238 550.5811 569.2076 583.9876 602.8870 626.8381 646.4221 655.4531 715.6963 746.6562 753.5784 766.0454 790.1558 840.4407 848.2136 868.7470 884.6051 891.6532 904.3034 929.9666 948.7184 958.6528 976.3883 985.7231 1016.7209 1027.2685 1038.4617 1041.7093 1045.2595 1052.5604 1074.5574 1084.4258 1093.5227 1128.8214 1158.1639 1167.0386 1179.6931 1188.3149 1220.3287 1246.0767 1258.3329 1270.1936 1285.4699 1295.6987 1310.6773 1331.1644 1352.1653 1374.1296 1386.7542 1395.4898 1398.2236 1412.3493 1429.7372 1440.7197 1453.4483 1462.3957 1465.0987 1474.7813 1477.3758 1487.2706 1494.0859 1526.7116 1546.1929 1586.7048 1592.2217 1603.2810 1616.3184 2961.0550 2965.8109 2974.9519 2980.5261 3000.9918 3042.5571 3048.6336 3064.2522 3074.8740 3079.1937 3115.3681 3123.9802 3126.0976 3128.5585 3143.0905 3157.6369 3166.4225 3173.1689
redmass: 3.8333 3.3619 2.6404 2.6787 1.2549 2.2860 2.2245 1.3734 3.5663 2.3199 4.3934 3.1561 3.4347 3.6925 4.8431 4.6687 3.0079 2.4246 4.3166 3.3040 4.0953 3.8898 4.3747 2.8221 3.4653 4.1399 3.2306 3.1920 4.3144 3.3292 4.0966 1.4928 1.5900 1.7780 2.0665 3.1578 2.5856 2.5840 1.8832 2.4290 1.4308 1.3582 2.0573 1.3320 1.4432 2.4313 2.3121 1.7974 2.4202 1.8346 2.5490 1.8240 3.1173 1.2531 1.9113 1.3154 1.3534 1.2585 1.3011 1.6510 1.9203 2.0040 1.4772 2.1487 1.6245 2.2173 3.9636 4.0155 1.9983 2.3712 1.2087 4.1715 2.7166 2.2770 1.1824 1.1122 1.2025 1.2745 1.0985 1.1624 1.7749 1.1723 3.1354 7.2476 6.3460 6.7879 5.9982 1.0688 1.0661 1.0432 1.0480 1.0633 1.0943 1.0945 1.0938 1.0992 1.0913 1.0940 1.0947 1.0854 1.0885 1.0900 1.0952 1.0954 1.0944
irintensity: 0.2116 0.0889 0.5617 1.1768 1.0355 1.9750 1.2465 0.2610 0.6313 3.9917 0.4021 1.6963 1.0530 0.2963 0.1132 1.3591 5.2924 1.6336 0.8596 0.4824 0.9531 0.7094 1.2367 0.8236 0.5465 0.5965 4.8181 1.8933 0.5658 8.8229 3.5247 72.9145 33.4534 3.8222 15.1694 2.3423 0.9693 1.6127 1.3991 3.0499 0.8794 0.4995 2.8451 0.0028 4.6055 3.8726 16.8184 0.9848 0.9305 0.4229 3.9275 3.2161 0.2198 1.2046 0.2029 0.8544 0.3081 0.5675 5.2416 5.0533 20.3816 0.8201 1.8105 1.7742 4.9176 0.7924 1.1068 2.6595 0.7005 3.4619 11.1388 9.9920 8.0223 11.9690 21.3260 6.3967 3.7335 14.0279 3.0306 19.6216 30.0309 6.2848 2.1806 4.8758 9.4639 10.5753 0.7657 33.5840 48.8430 36.0609 34.0856 44.9238 42.7637 19.4981 34.1622 29.7377 41.6022 19.6486 13.2723 0.4374 15.4939 15.8410 5.2129 35.8511 38.1146
temp: 298.150 k
press: 1.00000 atm
elementType: 6 6 6 6 6 6 6 6 6 6 6 6 6 6 6 6 6 6 6 1 1 1 1 1 1 1 1 1 1 1 1 1 1 1 1 1 1
symmnumber: 1
zpe: 812461.1 jmol-1
zpe.correction: 0.309450 hartree
zpe.thermalcorrener: 0.324924 hartree
zpe.thermalcorrenthalpy: 0.325868 hartree
zpe.thermalcorrgfe: 0.267526 hartree
zpe.sumelectzpe: -733.529224 hartree
zpe.sumelectthermal: -733.513750 hartree
zpe.sumelectthermalent: -733.512806 hartree
zpe.sumelectthermalfe: -733.571149 hartree
dipole: 0.9338 0.9472 0.0017
dipole: 1.3302
quadrupole: -99.0069 -99.7337 -117.6233
quadrupole: -0.4938 -0.5910 0.1285
quadrupole: 6.4477 5.7209 -12.1687 -0.4938 -0.5910 0.1285
hfenergy: -733.8386743 hartree
pointgroup: C01 [X(C19H18)]
dipole: -0.3708833 -0.3691923 0.0034263 debye
polarizability: 327.2046136|-0.5381427|226.1154346|4.4143956|-2.5367039|99.0489043 unknown
InChI: InChI=1S/C19H18/c1-12-13(2)19-16-9-5-6-14(16)10-11-18(19)17-8-4-3-7-15(12)17/h3-4,7-8,10-11H,5-6,9H2,1-2H3
charge 0 multiplicity 1
37 atoms
C  -2.168334 -0.199423 -0.057116
C  -3.289132 -1.243879 0.080932
C  -2.76192 1.082157 -0.09157
C  -4.515886 -0.415248 0.563274
C  -0.734779 -0.354265 -0.112315
C  -4.279445 1.003737 -0.02238
C  0.064328 0.85901 -0.107536
C  -0.050216 -1.655246 -0.140445
C  -1.974796 2.253807 -0.163481
C  1.526032 0.772098 -0.05017
C  1.339025 -1.730483 0.009623
C  -0.582138 2.131601 -0.15046
C  2.151507 -0.519769 0.055475
C  -0.840195 -2.933473 -0.40618
C  2.363074 1.931793 -0.069407
C  2.059998 -3.067709 0.117526
C  3.579832 -0.590457 0.146056
C  3.757534 1.837548 0.018988
C  4.374355 0.561706 0.129834
H  -3.516614 -1.710626 -0.899946
H  -3.047287 -2.06136 0.779098
H  -4.510076 -0.360665 1.668172
H  -5.47655 -0.860937 0.250846
H  -4.724765 1.806344 0.592684
H  -4.718598 1.091193 -1.037935
H  -2.446986 3.242111 -0.195397
H  0.018779 3.044188 -0.158403
H  -1.21339 -3.40967 0.521606
H  -1.708278 -2.736097 -1.04994
H  -0.222279 -3.67845 -0.931707
H  1.919158 2.927183 -0.155469
H  2.757469 -3.063343 0.975095
H  1.370388 -3.908411 0.275892
H  2.661284 -3.287594 -0.786899
H  4.068329 -1.565908 0.217751
H  4.370051 2.745762 0.001665
H  5.464919 0.480873 0.197437
